{"text_format":"3","workbook":"xlsx","n_sheets":14,"sheets":["INTRO","JAN","FEB","MAR","APR","MAY","JUN","JUL","AUG","SEP","OCT","NOV","DEC","SPLITS"],"not_rendered":{"images":1,"defined_names":53},"read":"whole","date_system":"1900"}

{"sheet":"INTRO","index":0,"n_rows":42,"n_cols":8,"rows_kept":42,"merged":[[2,6,2,8],[5,2,5,8],[7,2,7,6],[7,7,7,8],[9,2,9,6],[9,7,9,8],[10,2,10,6],[10,7,10,8],[11,2,11,6],[11,7,11,8],[12,2,12,6],[12,7,12,8],[13,2,13,6],[13,7,13,8],[14,2,14,6],[14,7,14,8],[15,2,15,6],[15,7,15,8],[16,2,16,6],[16,7,16,8],[19,3,19,7],[19,8,19,9],[21,3,24,8],[27,3,28,8],[30,4,30,8],[31,4,31,7],[33,4,33,7],[35,4,35,7],[37,4,39,7],[41,4,41,7],[46,1,46,9],[47,1,47,9]]}
[]
[]
[null,null,"MS State Department of Health",null,null,"Water System Name"]
[null,null,"Bureau of Public Water Supply",null,null,"PWS ID",null,"Reporting Year"]
[]
[null,null,"This is a requied report that is due every month by the 10th of the month for all fluoridating water systems..  Late reports will not be accepted.  Even if you are temporarily offline, you are required to submit this report.  If you need to change your status, please send an email to water.fluoride@msdh.ms.gov with your question.  Email reports to water.fluoride@msdh.ms.gov by the 10th."]
[]
[null,null,"BASIC QUESTIONS",{"$nulls":4},"ANSWERS"]
[]
[null,null,"Do you submit required monthly split samples every month (unless temorarily offline)? (Y/N)"]
[null,null,"Do you submit the required MFOR every month even when offline? (Y/N)"]
[null,null,"Are you fluoridating, suspended, or discontinued?"]
[null,null,"Which vendor(s) do you use for fluoride?"]
[null,null,"Type of fluoride additive (sodium fluoride, sodium fluorosilicate, fluorosiclic acid)"]
[null,null,"Type of fluoride equipment (saturator, acid-feed system, volumetric or gravimetric dry feeder)"]
[null,null,"How many wells/plants have fluoride equipment installed on them?"]
[null,null,"What brand fluoride do you use and what is its country of origin?"]
[]
[]
[]
[]
[null,null,"How to find your TFID","Using your fluoride barcodes, locate the TFID in the upper left corner just below your PWS ID.  It is five digits and begins with the letters \"TF\" followed by three numbers.  It stands for Treatment Facility ID.  Each well or plant that has fluoride equipment installed on it is known as a treatment facility and a unique ID.  This is how MSDH identifies/tracks your fluoride data.  We do not use the local name(s) like \"Murphy Street Well\" or \"ABC Water Plant\".  If you have five wells/plants with fluoride, you will enter five TFIDs below."]
[]
[]
[]
[]
[]
[null,null,"Treatment Facility ID (TFID)","Enter your treatment facility IDs in the spaces provided to the left.  Enter one TFID in each box.  Follow the same format as the two example TFIDs entered as a guide for you.  You'll have between 1 and 12."]
[null,null,"EXAMPLE     TF080    EXAMPLE"]
[null,null,"EXAMPLE     TF107    EXAMPLE"]
[]
[{"$nulls":4},"The MFOR is due by the 10th of each month."]
[]
[{"$nulls":4},"Email completed report to water.fluoride@msdh.ms.gov."]
[]
[{"$nulls":4},"If well/plant is offline, mark \"OFF\" on the dates offline."]
[]
[{"$nulls":4},"Do not submit split samples when offline.  Instead, email water.fluoride@msdh.ms.gov with the date you have gone offline, the reason, and the estimated startup date.  Send another email when you are back online."]
[]
[]
[]
[{"$nulls":4},"Do not send empty bottles to the lab when offline!"]

{"sheet":"JAN","index":1,"n_rows":65,"n_cols":13,"rows_kept":65,"merged":[[0,0,0,12],[1,0,1,12],[3,0,3,4],[3,5,3,12],[4,0,4,4],[4,5,4,8],[4,9,6,12],[5,0,5,4],[5,5,5,8],[6,0,6,4],[6,5,6,8],[49,0,53,0],[49,1,53,12],[55,0,69,2],[55,3,56,12],[58,3,59,12],[61,3,62,12],[64,3,69,12]]}
["Mississippi State Department of Health-Bureau of Public Water Supply"]
["Monthly Fluoride Operating Report (MFOR)--DAILY SAMPLE ENTRY FOR JANUARY"]
[]
["Water System Name:",{"$nulls":4},{"$f":"INTRO!G3","v":0}]
["PWS ID:",{"$nulls":4},{"$f":"INTRO!G4","v":0},{"$nulls":3},"Email to water.fluoride@msdh.ms.gov by the 10th of each month.  Reports are due every month, even if offline!"]
["Number of Treatment Facilities:",{"$nulls":4},{"$f":"INTRO!H16","v":0}]
["Reporting Year:",{"$nulls":4},{"$f":"SPLITS!F7","v":0}]
[]
["DATE",{"$f":"INTRO!C31","v":0},{"$f":"INTRO!C32","v":0},{"$f":"INTRO!C33","v":0},{"$f":"INTRO!C34","v":0},{"$f":"INTRO!C35","v":0},{"$f":"INTRO!C36","v":0},{"$f":"INTRO!C37","v":0},{"$f":"INTRO!C38","v":0},{"$f":"INTRO!C39","v":0},{"$f":"INTRO!C40","v":0},{"$f":"INTRO!C41","v":0},{"$f":"INTRO!C42","v":0}]
[{"$f":"DATE(INTRO!I4,1,1)","v":"1900-01-01"}]
[{"$f":"IF(MONTH(A10+1)=MONTH(A10),A10+1,\"\")","v":"1900-01-02"}]
[{"$f":"IF(MONTH(A11+1)=MONTH(A11),A11+1,\"\")","v":"1900-01-03"}]
["1900-01-04"]
["1900-01-05"]
["1900-01-06"]
["1900-01-07"]
["1900-01-08"]
["1900-01-09"]
["1900-01-10"]
["1900-01-11"]
["1900-01-12"]
["1900-01-13"]
["1900-01-14"]
["1900-01-15"]
["1900-01-16"]
["1900-01-17"]
["1900-01-18"]
["1900-01-19"]
["1900-01-20"]
["1900-01-21"]
["1900-01-22"]
["1900-01-23"]
["1900-01-24"]
["1900-01-25"]
["1900-01-26"]
["1900-01-27"]
["1900-01-28"]
["1900-01-29"]
["1900-01-30"]
["1900-01-31"]
["AVG",{"$f":"IFERROR(AVERAGE(B10:B40),0)","v":{"v":0,"d":"0.00"}},{"$f":"IFERROR(AVERAGE(C10:C40),0)","v":{"v":0,"d":"0.00"}},{"v":0,"d":"0.00"},{"v":0,"d":"0.00"},{"v":0,"d":"0.00"},{"v":0,"d":"0.00"},{"v":0,"d":"0.00"},{"v":0,"d":"0.00"},{"v":0,"d":"0.00"},{"v":0,"d":"0.00"},{"v":0,"d":"0.00"},{"v":0,"d":"0.00"}]
["MAX",{"$f":"MAX(B10:B40)","v":{"v":0,"d":"0.00"}},{"$f":"MAX(C10:C40)","v":{"v":0,"d":"0.00"}},{"v":0,"d":"0.00"},{"v":0,"d":"0.00"},{"v":0,"d":"0.00"},{"v":0,"d":"0.00"},{"v":0,"d":"0.00"},{"v":0,"d":"0.00"},{"v":0,"d":"0.00"},{"v":0,"d":"0.00"},{"v":0,"d":"0.00"},{"v":0,"d":"0.00"}]
["MIN",{"$f":"MIN(B10:B40)","v":{"v":0,"d":"0.00"}},{"$f":"MIN(C10:C40)","v":{"v":0,"d":"0.00"}},{"v":0,"d":"0.00"},{"v":0,"d":"0.00"},{"v":0,"d":"0.00"},{"v":0,"d":"0.00"},{"v":0,"d":"0.00"},{"v":0,"d":"0.00"},{"v":0,"d":"0.00"},{"v":0,"d":"0.00"},{"v":0,"d":"0.00"},{"v":0,"d":"0.00"}]
["Count",{"$f":"COUNT(B10:B40)","v":0},{"$f":"COUNT(C10:C40)","v":0},0,0,0,0,0,0,0,0,0,0]
["Sufficient Samples",{"$f":"IF(COUNT(B10:B40)>=13, \"YES\", \"NO\")","v":"NO"},{"$f":"IF(COUNT(C10:C40)>=13, \"YES\", \"NO\")","v":"NO"},"NO","NO","NO","NO","NO","NO","NO","NO","NO","NO"]
["Number In-Range",{"$f":"COUNTIFS(B10:B40, \">=0.54\", B10:B40, \"<=1.24\")","v":0},{"$f":"COUNTIFS(C10:C40, \">=0.54\", C10:C40, \"<=1.24\")","v":0},0,0,0,0,0,0,0,0,0,0]
["Sufficient In-Range",{"$f":"IFERROR(IF(COUNTIFS(B10:B40,\">=0.54\",B10:B40,\"<=1.24\")/COUNTA(B10:B40)>=0.9, \"YES\", \"NO\"),\"NA\")","v":"NA"},"NA","NA","NA","NA","NA","NA","NA","NA","NA","NA","NA"]
["Percent In-Range",{"$f":"IFERROR(COUNTIFS(B10:B40,\">=0.54\",B10:B40,\"<=1.24\")/COUNTA(B10:B40),\"NA\")","v":"NA"},"NA","NA","NA","NA","NA","NA","NA","NA","NA","NA","NA"]
[]
["Operator Notes for January"]
[]
[]
[]
[]
[]
["HELPFUL TIPS FOR ANLAYZING FLUORIDE",null,null,"1. Always make sure you DI water is fresh.  Replace it every few months.  You can get free DI water from Water Supply.  Call 601-327-5734 to request DI water.  Save your old bottles to send back."]
[]
[]
[{"$nulls":3},"2. Use a fluoride standard solution when testing fluoride.  Set it up just like you were testing a water sample.  You can get free standard solution from MSDH. Call 601-327-5734 to request standard."]
[]
[]
[{"$nulls":3},"3. Make sure your DI water, standard solution, sample water, reagent, meter, and anything else you use to test fluoride are all the same temperature before analyzing.  Use a thermometer, if needed."]
[]
[]
[{"$nulls":3},"4.  When you are temporarily offline for whatever reason, mark \"OFF\" on each of the days you are offline on your MFOR.  DO NOT collect SPLIT samples while offline.  Instead, send an email to water.fluoride@msdh.ms.gov with the date you have gone offline, the reason, and the estimated startup date.  When you startup again, email water.fluoride@msdh.ms.gov with your startup date.    DO NOT SEND EMPTY BOTTLES TO THE LAB."]

{"sheet":"FEB","index":2,"n_rows":65,"n_cols":13,"rows_kept":65,"merged":[[0,0,0,12],[1,0,1,12],[3,0,3,4],[3,5,3,12],[4,0,4,4],[4,5,4,8],[4,9,6,12],[5,0,5,4],[5,5,5,8],[6,0,6,4],[6,5,6,8],[49,0,53,0],[49,1,53,12],[55,0,69,2],[55,3,56,12],[58,3,59,12],[61,3,62,12],[64,3,69,12]]}
["Mississippi State Department of Health-Bureau of Public Water Supply"]
["Monthly Fluoride Operating Report (MFOR)--DAILY SAMPLE ENTRY FOR FEBRUARY"]
[]
["Water System Name:",{"$nulls":4},{"$f":"INTRO!G3","v":0}]
["PWS ID:",{"$nulls":4},{"$f":"INTRO!G4","v":0},{"$nulls":3},"Email to water.fluoride@msdh.ms.gov by the 10th of each month.  Reports are due every month, even if offline!"]
["Number of Treatment Facilities:",{"$nulls":4},{"$f":"INTRO!H16","v":0}]
["Reporting Year:",{"$nulls":4},{"$f":"SPLITS!F7","v":0}]
[]
["DATE",{"$f":"INTRO!C31","v":0},{"$f":"INTRO!C32","v":0},{"$f":"INTRO!C33","v":0},{"$f":"INTRO!C34","v":0},{"$f":"INTRO!C35","v":0},{"$f":"INTRO!C36","v":0},{"$f":"INTRO!C37","v":0},{"$f":"INTRO!C38","v":0},{"$f":"INTRO!C39","v":0},{"$f":"INTRO!C40","v":0},{"$f":"INTRO!C41","v":0},{"$f":"INTRO!C42","v":0}]
[{"$f":"DATE(INTRO!I4,2,1)","v":"1900-02-01"}]
[{"$f":"IF(MONTH(A10+1)=MONTH(A10),A10+1,\"\")","v":"1900-02-02"}]
[{"$f":"IF(MONTH(A11+1)=MONTH(A11),A11+1,\"\")","v":"1900-02-03"}]
["1900-02-04"]
["1900-02-05"]
["1900-02-06"]
["1900-02-07"]
["1900-02-08"]
["1900-02-09"]
["1900-02-10"]
["1900-02-11"]
["1900-02-12"]
["1900-02-13"]
["1900-02-14"]
["1900-02-15"]
["1900-02-16"]
["1900-02-17"]
["1900-02-18"]
["1900-02-19"]
["1900-02-20"]
["1900-02-21"]
["1900-02-22"]
["1900-02-23"]
["1900-02-24"]
["1900-02-25"]
["1900-02-26"]
["1900-02-27"]
["1900-02-28"]
[60]
[]
[]
["AVG",{"$f":"IFERROR(AVERAGE(B10:B40),0)","v":{"v":0,"d":"0.00"}},{"$f":"IFERROR(AVERAGE(C10:C40),0)","v":{"v":0,"d":"0.00"}},{"v":0,"d":"0.00"},{"v":0,"d":"0.00"},{"v":0,"d":"0.00"},{"v":0,"d":"0.00"},{"v":0,"d":"0.00"},{"v":0,"d":"0.00"},{"v":0,"d":"0.00"},{"v":0,"d":"0.00"},{"v":0,"d":"0.00"},{"v":0,"d":"0.00"}]
["MAX",{"$f":"MAX(B10:B40)","v":{"v":0,"d":"0.00"}},{"$f":"MAX(C10:C40)","v":{"v":0,"d":"0.00"}},{"v":0,"d":"0.00"},{"v":0,"d":"0.00"},{"v":0,"d":"0.00"},{"v":0,"d":"0.00"},{"v":0,"d":"0.00"},{"v":0,"d":"0.00"},{"v":0,"d":"0.00"},{"v":0,"d":"0.00"},{"v":0,"d":"0.00"},{"v":0,"d":"0.00"}]
["MIN",{"$f":"MIN(B10:B40)","v":{"v":0,"d":"0.00"}},{"$f":"MIN(C10:C40)","v":{"v":0,"d":"0.00"}},{"v":0,"d":"0.00"},{"v":0,"d":"0.00"},{"v":0,"d":"0.00"},{"v":0,"d":"0.00"},{"v":0,"d":"0.00"},{"v":0,"d":"0.00"},{"v":0,"d":"0.00"},{"v":0,"d":"0.00"},{"v":0,"d":"0.00"},{"v":0,"d":"0.00"}]
["Count",{"$f":"COUNT(B10:B40)","v":0},{"$f":"COUNT(C10:C40)","v":0},0,0,0,0,0,0,0,0,0,0]
["Sufficient Samples",{"$f":"IF(COUNT(B10:B40)>=13, \"YES\", \"NO\")","v":"NO"},{"$f":"IF(COUNT(C10:C40)>=13, \"YES\", \"NO\")","v":"NO"},"NO","NO","NO","NO","NO","NO","NO","NO","NO","NO"]
["Number In-Range",{"$f":"COUNTIFS(B10:B40, \">=0.54\", B10:B40, \"<=1.24\")","v":0},{"$f":"COUNTIFS(C10:C40, \">=0.54\", C10:C40, \"<=1.24\")","v":0},0,0,0,0,0,0,0,0,0,0]
["Sufficient In-Range",{"$f":"IFERROR(IF(COUNTIFS(B10:B40,\">=0.54\",B10:B40,\"<=1.24\")/COUNTA(B10:B40)>=0.9, \"YES\", \"NO\"),\"NA\")","v":"NA"},"NA","NA","NA","NA","NA","NA","NA","NA","NA","NA","NA"]
["Percent In-Range",{"$f":"IFERROR(COUNTIFS(B10:B40,\">=0.54\",B10:B40,\"<=1.24\")/COUNTA(B10:B40),\"NA\")","v":"NA"},"NA","NA","NA","NA","NA","NA","NA","NA","NA","NA","NA"]
[]
["Operator Notes for February"]
[]
[]
[]
[]
[]
["HELPFUL TIPS FOR ANLAYZING FLUORIDE",null,null,"1. Always make sure you DI water is fresh.  Replace it every few months.  You can get free DI water from Water Supply.  Call 601-327-5734 to request DI water.  Save your old bottles to send back."]
[]
[]
[{"$nulls":3},"2. Use a fluoride standard solution when testing fluoride.  Set it up just like you were testing a water sample.  You can get free standard solution from MSDH. Call 601-327-5734 to request standard."]
[]
[]
[{"$nulls":3},"3. Make sure your DI water, standard solution, sample water, reagent, meter, and anything else you use to test fluoride are all the same temperature before analyzing.  Use a thermometer, if needed."]
[]
[]
[{"$nulls":3},"4.  When you are temporarily offline for whatever reason, mark \"OFF\" on each of the days you are offline on your MFOR.  DO NOT collect SPLIT samples while offline.  Instead, send an email to water.fluoride@msdh.ms.gov with the date you have gone offline, the reason, and the estimated startup date.  When you startup again, email water.fluoride@msdh.ms.gov with your startup date.    DO NOT SEND EMPTY BOTTLES TO THE LAB."]

{"sheet":"MAR","index":3,"n_rows":65,"n_cols":13,"rows_kept":65,"merged":[[0,0,0,12],[1,0,1,12],[3,0,3,4],[3,5,3,12],[4,0,4,4],[4,5,4,8],[4,9,6,12],[5,0,5,4],[5,5,5,8],[6,0,6,4],[6,5,6,8],[49,0,53,0],[49,1,53,12],[55,0,69,2],[55,3,56,12],[58,3,59,12],[61,3,62,12],[64,3,69,12]]}
["Mississippi State Department of Health-Bureau of Public Water Supply"]
["Monthly Fluoride Operating Report (MFOR)--DAILY SAMPLE ENTRY FOR MARCH"]
[]
["Water System Name:",{"$nulls":4},{"$f":"INTRO!G3","v":0}]
["PWS ID:",{"$nulls":4},{"$f":"INTRO!G4","v":0},{"$nulls":3},"Email to water.fluoride@msdh.ms.gov by the 10th of each month.  Reports are due every month, even if offline!"]
["Number of Treatment Facilities:",{"$nulls":4},{"$f":"INTRO!H16","v":0}]
["Reporting Year:",{"$nulls":4},{"$f":"SPLITS!F7","v":0}]
[]
["DATE",{"$f":"INTRO!C31","v":0},{"$f":"INTRO!C32","v":0},{"$f":"INTRO!C33","v":0},{"$f":"INTRO!C34","v":0},{"$f":"INTRO!C35","v":0},{"$f":"INTRO!C36","v":0},{"$f":"INTRO!C37","v":0},{"$f":"INTRO!C38","v":0},{"$f":"INTRO!C39","v":0},{"$f":"INTRO!C40","v":0},{"$f":"INTRO!C41","v":0},{"$f":"INTRO!C42","v":0}]
[{"$f":"DATE(INTRO!I4,3,1)","v":"1900-03-01"}]
[{"$f":"IF(MONTH(A10+1)=MONTH(A10),A10+1,\"\")","v":"1900-03-02"}]
[{"$f":"IF(MONTH(A11+1)=MONTH(A11),A11+1,\"\")","v":"1900-03-03"}]
["1900-03-04"]
["1900-03-05"]
["1900-03-06"]
["1900-03-07"]
["1900-03-08"]
["1900-03-09"]
["1900-03-10"]
["1900-03-11"]
["1900-03-12"]
["1900-03-13"]
["1900-03-14"]
["1900-03-15"]
["1900-03-16"]
["1900-03-17"]
["1900-03-18"]
["1900-03-19"]
["1900-03-20"]
["1900-03-21"]
["1900-03-22"]
["1900-03-23"]
["1900-03-24"]
["1900-03-25"]
["1900-03-26"]
["1900-03-27"]
["1900-03-28"]
["1900-03-29"]
["1900-03-30"]
["1900-03-31"]
["AVG",{"$f":"IFERROR(AVERAGE(B10:B40),0)","v":{"v":0,"d":"0.00"}},{"$f":"IFERROR(AVERAGE(C10:C40),0)","v":{"v":0,"d":"0.00"}},{"v":0,"d":"0.00"},{"v":0,"d":"0.00"},{"v":0,"d":"0.00"},{"v":0,"d":"0.00"},{"v":0,"d":"0.00"},{"v":0,"d":"0.00"},{"v":0,"d":"0.00"},{"v":0,"d":"0.00"},{"v":0,"d":"0.00"},{"v":0,"d":"0.00"}]
["MAX",{"$f":"MAX(B10:B40)","v":{"v":0,"d":"0.00"}},{"$f":"MAX(C10:C40)","v":{"v":0,"d":"0.00"}},{"v":0,"d":"0.00"},{"v":0,"d":"0.00"},{"v":0,"d":"0.00"},{"v":0,"d":"0.00"},{"v":0,"d":"0.00"},{"v":0,"d":"0.00"},{"v":0,"d":"0.00"},{"v":0,"d":"0.00"},{"v":0,"d":"0.00"},{"v":0,"d":"0.00"}]
["MIN",{"$f":"MIN(B10:B40)","v":{"v":0,"d":"0.00"}},{"$f":"MIN(C10:C40)","v":{"v":0,"d":"0.00"}},{"v":0,"d":"0.00"},{"v":0,"d":"0.00"},{"v":0,"d":"0.00"},{"v":0,"d":"0.00"},{"v":0,"d":"0.00"},{"v":0,"d":"0.00"},{"v":0,"d":"0.00"},{"v":0,"d":"0.00"},{"v":0,"d":"0.00"},{"v":0,"d":"0.00"}]
["Count",{"$f":"COUNT(B10:B40)","v":0},{"$f":"COUNT(C10:C40)","v":0},0,0,0,0,0,0,0,0,0,0]
["Sufficient Samples",{"$f":"IF(COUNT(B10:B40)>=13, \"YES\", \"NO\")","v":"NO"},{"$f":"IF(COUNT(C10:C40)>=13, \"YES\", \"NO\")","v":"NO"},"NO","NO","NO","NO","NO","NO","NO","NO","NO","NO"]
["Number In-Range",{"$f":"COUNTIFS(B10:B40, \">=0.54\", B10:B40, \"<=1.24\")","v":0},{"$f":"COUNTIFS(C10:C40, \">=0.54\", C10:C40, \"<=1.24\")","v":0},0,0,0,0,0,0,0,0,0,0]
["Sufficient In-Range",{"$f":"IFERROR(IF(COUNTIFS(B10:B40,\">=0.54\",B10:B40,\"<=1.24\")/COUNTA(B10:B40)>=0.9, \"YES\", \"NO\"),\"NA\")","v":"NA"},"NA","NA","NA","NA","NA","NA","NA","NA","NA","NA","NA"]
["Percent In-Range",{"$f":"IFERROR(COUNTIFS(B10:B40,\">=0.54\",B10:B40,\"<=1.24\")/COUNTA(B10:B40),\"NA\")","v":"NA"},"NA","NA","NA","NA","NA","NA","NA","NA","NA","NA","NA"]
[]
["Operator Notes for March"]
[]
[]
[]
[]
[]
["HELPFUL TIPS FOR ANLAYZING FLUORIDE",null,null,"1. Always make sure you DI water is fresh.  Replace it every few months.  You can get free DI water from Water Supply.  Call 601-327-5734 to request DI water.  Save your old bottles to send back."]
[]
[]
[{"$nulls":3},"2. Use a fluoride standard solution when testing fluoride.  Set it up just like you were testing a water sample.  You can get free standard solution from MSDH. Call 601-327-5734 to request standard."]
[]
[]
[{"$nulls":3},"3. Make sure your DI water, standard solution, sample water, reagent, meter, and anything else you use to test fluoride are all the same temperature before analyzing.  Use a thermometer, if needed."]
[]
[]
[{"$nulls":3},"4.  When you are temporarily offline for whatever reason, mark \"OFF\" on each of the days you are offline on your MFOR.  DO NOT collect SPLIT samples while offline.  Instead, send an email to water.fluoride@msdh.ms.gov with the date you have gone offline, the reason, and the estimated startup date.  When you startup again, email water.fluoride@msdh.ms.gov with your startup date.    DO NOT SEND EMPTY BOTTLES TO THE LAB."]

{"sheet":"APR","index":4,"n_rows":65,"n_cols":13,"rows_kept":65,"merged":[[0,0,0,12],[1,0,1,12],[3,0,3,4],[3,5,3,12],[4,0,4,4],[4,5,4,8],[4,9,6,12],[5,0,5,4],[5,5,5,8],[6,0,6,4],[6,5,6,8],[49,0,53,0],[49,1,53,12],[55,0,69,2],[55,3,56,12],[58,3,59,12],[61,3,62,12],[64,3,69,12]]}
["Mississippi State Department of Health-Bureau of Public Water Supply"]
["Monthly Fluoride Operating Report (MFOR)--DAILY SAMPLE ENTRY FOR APRIL"]
[]
["Water System Name:",{"$nulls":4},{"$f":"INTRO!G3","v":0}]
["PWS ID:",{"$nulls":4},{"$f":"INTRO!G4","v":0},{"$nulls":3},"Email to water.fluoride@msdh.ms.gov by the 10th of each month.  Reports are due every month, even if offline!"]
["Number of Treatment Facilities:",{"$nulls":4},{"$f":"INTRO!H16","v":0}]
["Reporting Year:",{"$nulls":4},{"$f":"SPLITS!F7","v":0}]
[]
["DATE",{"$f":"INTRO!C31","v":0},{"$f":"INTRO!C32","v":0},{"$f":"INTRO!C33","v":0},{"$f":"INTRO!C34","v":0},{"$f":"INTRO!C35","v":0},{"$f":"INTRO!C36","v":0},{"$f":"INTRO!C37","v":0},{"$f":"INTRO!C38","v":0},{"$f":"INTRO!C39","v":0},{"$f":"INTRO!C40","v":0},{"$f":"INTRO!C41","v":0},{"$f":"INTRO!C42","v":0}]
[{"$f":"DATE(INTRO!I4,4,1)","v":"1900-04-01"}]
[{"$f":"IF(MONTH(A10+1)=MONTH(A10),A10+1,\"\")","v":"1900-04-02"}]
[{"$f":"IF(MONTH(A11+1)=MONTH(A11),A11+1,\"\")","v":"1900-04-03"}]
["1900-04-04"]
["1900-04-05"]
["1900-04-06"]
["1900-04-07"]
["1900-04-08"]
["1900-04-09"]
["1900-04-10"]
["1900-04-11"]
["1900-04-12"]
["1900-04-13"]
["1900-04-14"]
["1900-04-15"]
["1900-04-16"]
["1900-04-17"]
["1900-04-18"]
["1900-04-19"]
["1900-04-20"]
["1900-04-21"]
["1900-04-22"]
["1900-04-23"]
["1900-04-24"]
["1900-04-25"]
["1900-04-26"]
["1900-04-27"]
["1900-04-28"]
["1900-04-29"]
["1900-04-30"]
[""]
["AVG",{"$f":"IFERROR(AVERAGE(B10:B40),0)","v":{"v":0,"d":"0.00"}},{"$f":"IFERROR(AVERAGE(C10:C40),0)","v":{"v":0,"d":"0.00"}},{"v":0,"d":"0.00"},{"v":0,"d":"0.00"},{"v":0,"d":"0.00"},{"v":0,"d":"0.00"},{"v":0,"d":"0.00"},{"v":0,"d":"0.00"},{"v":0,"d":"0.00"},{"v":0,"d":"0.00"},{"v":0,"d":"0.00"},{"v":0,"d":"0.00"}]
["MAX",{"$f":"MAX(B10:B40)","v":{"v":0,"d":"0.00"}},{"$f":"MAX(C10:C40)","v":{"v":0,"d":"0.00"}},{"v":0,"d":"0.00"},{"v":0,"d":"0.00"},{"v":0,"d":"0.00"},{"v":0,"d":"0.00"},{"v":0,"d":"0.00"},{"v":0,"d":"0.00"},{"v":0,"d":"0.00"},{"v":0,"d":"0.00"},{"v":0,"d":"0.00"},{"v":0,"d":"0.00"}]
["MIN",{"$f":"MIN(B10:B40)","v":{"v":0,"d":"0.00"}},{"$f":"MIN(C10:C40)","v":{"v":0,"d":"0.00"}},{"v":0,"d":"0.00"},{"v":0,"d":"0.00"},{"v":0,"d":"0.00"},{"v":0,"d":"0.00"},{"v":0,"d":"0.00"},{"v":0,"d":"0.00"},{"v":0,"d":"0.00"},{"v":0,"d":"0.00"},{"v":0,"d":"0.00"},{"v":0,"d":"0.00"}]
["Count",{"$f":"COUNT(B10:B40)","v":0},{"$f":"COUNT(C10:C40)","v":0},0,0,0,0,0,0,0,0,0,0]
["Sufficient Samples",{"$f":"IF(COUNT(B10:B40)>=13, \"YES\", \"NO\")","v":"NO"},{"$f":"IF(COUNT(C10:C40)>=13, \"YES\", \"NO\")","v":"NO"},"NO","NO","NO","NO","NO","NO","NO","NO","NO","NO"]
["Number In-Range",{"$f":"COUNTIFS(B10:B40, \">=0.54\", B10:B40, \"<=1.24\")","v":0},{"$f":"COUNTIFS(C10:C40, \">=0.54\", C10:C40, \"<=1.24\")","v":0},0,0,0,0,0,0,0,0,0,0]
["Sufficient In-Range",{"$f":"IFERROR(IF(COUNTIFS(B10:B40,\">=0.54\",B10:B40,\"<=1.24\")/COUNTA(B10:B40)>=0.9, \"YES\", \"NO\"),\"NA\")","v":"NA"},"NA","NA","NA","NA","NA","NA","NA","NA","NA","NA","NA"]
["Percent In-Range",{"$f":"IFERROR(COUNTIFS(B10:B40,\">=0.54\",B10:B40,\"<=1.24\")/COUNTA(B10:B40),\"NA\")","v":"NA"},"NA","NA","NA","NA","NA","NA","NA","NA","NA","NA","NA"]
[]
["Operator Notes for April"]
[]
[]
[]
[]
[]
["HELPFUL TIPS FOR ANLAYZING FLUORIDE",null,null,"1. Always make sure you DI water is fresh.  Replace it every few months.  You can get free DI water from Water Supply.  Call 601-327-5734 to request DI water.  Save your old bottles to send back."]
[]
[]
[{"$nulls":3},"2. Use a fluoride standard solution when testing fluoride.  Set it up just like you were testing a water sample.  You can get free standard solution from MSDH. Call 601-327-5734 to request standard."]
[]
[]
[{"$nulls":3},"3. Make sure your DI water, standard solution, sample water, reagent, meter, and anything else you use to test fluoride are all the same temperature before analyzing.  Use a thermometer, if needed."]
[]
[]
[{"$nulls":3},"4.  When you are temporarily offline for whatever reason, mark \"OFF\" on each of the days you are offline on your MFOR.  DO NOT collect SPLIT samples while offline.  Instead, send an email to water.fluoride@msdh.ms.gov with the date you have gone offline, the reason, and the estimated startup date.  When you startup again, email water.fluoride@msdh.ms.gov with your startup date.    DO NOT SEND EMPTY BOTTLES TO THE LAB."]

{"sheet":"MAY","index":5,"n_rows":65,"n_cols":13,"rows_kept":65,"merged":[[0,0,0,12],[1,0,1,12],[3,0,3,4],[3,5,3,12],[4,0,4,4],[4,5,4,8],[4,9,6,12],[5,0,5,4],[5,5,5,8],[6,0,6,4],[6,5,6,8],[49,0,53,0],[49,1,53,12],[55,0,69,2],[55,3,56,12],[58,3,59,12],[61,3,62,12],[64,3,69,12]]}
["Mississippi State Department of Health-Bureau of Public Water Supply"]
["Monthly Fluoride Operating Report (MFOR)--DAILY SAMPLE ENTRY FOR MAY"]
[]
["Water System Name:",{"$nulls":4},{"$f":"INTRO!G3","v":0}]
["PWS ID:",{"$nulls":4},{"$f":"INTRO!G4","v":0},{"$nulls":3},"Email to water.fluoride@msdh.ms.gov by the 10th of each month.  Reports are due every month, even if offline!"]
["Number of Treatment Facilities:",{"$nulls":4},{"$f":"INTRO!H16","v":0}]
["Reporting Year:",{"$nulls":4},{"$f":"SPLITS!F7","v":0}]
[]
["DATE",{"$f":"INTRO!C31","v":0},{"$f":"INTRO!C32","v":0},{"$f":"INTRO!C33","v":0},{"$f":"INTRO!C34","v":0},{"$f":"INTRO!C35","v":0},{"$f":"INTRO!C36","v":0},{"$f":"INTRO!C37","v":0},{"$f":"INTRO!C38","v":0},{"$f":"INTRO!C39","v":0},{"$f":"INTRO!C40","v":0},{"$f":"INTRO!C41","v":0},{"$f":"INTRO!C42","v":0}]
[{"$f":"DATE(INTRO!I4,5,1)","v":"1900-05-01"}]
[{"$f":"IF(MONTH(A10+1)=MONTH(A10),A10+1,\"\")","v":"1900-05-02"}]
[{"$f":"IF(MONTH(A11+1)=MONTH(A11),A11+1,\"\")","v":"1900-05-03"}]
["1900-05-04"]
["1900-05-05"]
["1900-05-06"]
["1900-05-07"]
["1900-05-08"]
["1900-05-09"]
["1900-05-10"]
["1900-05-11"]
["1900-05-12"]
["1900-05-13"]
["1900-05-14"]
["1900-05-15"]
["1900-05-16"]
["1900-05-17"]
["1900-05-18"]
["1900-05-19"]
["1900-05-20"]
["1900-05-21"]
["1900-05-22"]
["1900-05-23"]
["1900-05-24"]
["1900-05-25"]
["1900-05-26"]
["1900-05-27"]
["1900-05-28"]
["1900-05-29"]
["1900-05-30"]
["1900-05-31"]
["AVG",{"$f":"IFERROR(AVERAGE(B10:B40),0)","v":{"v":0,"d":"0.00"}},{"$f":"IFERROR(AVERAGE(C10:C40),0)","v":{"v":0,"d":"0.00"}},{"v":0,"d":"0.00"},{"v":0,"d":"0.00"},{"v":0,"d":"0.00"},{"v":0,"d":"0.00"},{"v":0,"d":"0.00"},{"v":0,"d":"0.00"},{"v":0,"d":"0.00"},{"v":0,"d":"0.00"},{"v":0,"d":"0.00"},{"v":0,"d":"0.00"}]
["MAX",{"$f":"MAX(B10:B40)","v":{"v":0,"d":"0.00"}},{"$f":"MAX(C10:C40)","v":{"v":0,"d":"0.00"}},{"v":0,"d":"0.00"},{"v":0,"d":"0.00"},{"v":0,"d":"0.00"},{"v":0,"d":"0.00"},{"v":0,"d":"0.00"},{"v":0,"d":"0.00"},{"v":0,"d":"0.00"},{"v":0,"d":"0.00"},{"v":0,"d":"0.00"},{"v":0,"d":"0.00"}]
["MIN",{"$f":"MIN(B10:B40)","v":{"v":0,"d":"0.00"}},{"$f":"MIN(C10:C40)","v":{"v":0,"d":"0.00"}},{"v":0,"d":"0.00"},{"v":0,"d":"0.00"},{"v":0,"d":"0.00"},{"v":0,"d":"0.00"},{"v":0,"d":"0.00"},{"v":0,"d":"0.00"},{"v":0,"d":"0.00"},{"v":0,"d":"0.00"},{"v":0,"d":"0.00"},{"v":0,"d":"0.00"}]
["Count",{"$f":"COUNT(B10:B40)","v":0},{"$f":"COUNT(C10:C40)","v":0},0,0,0,0,0,0,0,0,0,0]
["Sufficient Samples",{"$f":"IF(COUNT(B10:B40)>=13, \"YES\", \"NO\")","v":"NO"},{"$f":"IF(COUNT(C10:C40)>=13, \"YES\", \"NO\")","v":"NO"},"NO","NO","NO","NO","NO","NO","NO","NO","NO","NO"]
["Number In-Range",{"$f":"COUNTIFS(B10:B40, \">=0.54\", B10:B40, \"<=1.24\")","v":0},{"$f":"COUNTIFS(C10:C40, \">=0.54\", C10:C40, \"<=1.24\")","v":0},0,0,0,0,0,0,0,0,0,0]
["Sufficient In-Range",{"$f":"IFERROR(IF(COUNTIFS(B10:B40,\">=0.54\",B10:B40,\"<=1.24\")/COUNTA(B10:B40)>=0.9, \"YES\", \"NO\"),\"NA\")","v":"NA"},"NA","NA","NA","NA","NA","NA","NA","NA","NA","NA","NA"]
["Percent In-Range",{"$f":"IFERROR(COUNTIFS(B10:B40,\">=0.54\",B10:B40,\"<=1.24\")/COUNTA(B10:B40),\"NA\")","v":"NA"},"NA","NA","NA","NA","NA","NA","NA","NA","NA","NA","NA"]
[]
["Operator Notes for May"]
[]
[]
[]
[]
[]
["HELPFUL TIPS FOR ANLAYZING FLUORIDE",null,null,"1. Always make sure you DI water is fresh.  Replace it every few months.  You can get free DI water from Water Supply.  Call 601-327-5734 to request DI water.  Save your old bottles to send back."]
[]
[]
[{"$nulls":3},"2. Use a fluoride standard solution when testing fluoride.  Set it up just like you were testing a water sample.  You can get free standard solution from MSDH. Call 601-327-5734 to request standard."]
[]
[]
[{"$nulls":3},"3. Make sure your DI water, standard solution, sample water, reagent, meter, and anything else you use to test fluoride are all the same temperature before analyzing.  Use a thermometer, if needed."]
[]
[]
[{"$nulls":3},"4.  When you are temporarily offline for whatever reason, mark \"OFF\" on each of the days you are offline on your MFOR.  DO NOT collect SPLIT samples while offline.  Instead, send an email to water.fluoride@msdh.ms.gov with the date you have gone offline, the reason, and the estimated startup date.  When you startup again, email water.fluoride@msdh.ms.gov with your startup date.    DO NOT SEND EMPTY BOTTLES TO THE LAB."]

{"sheet":"JUN","index":6,"n_rows":65,"n_cols":13,"rows_kept":65,"merged":[[0,0,0,12],[1,0,1,12],[3,0,3,4],[3,5,3,12],[4,0,4,4],[4,5,4,8],[4,9,6,12],[5,0,5,4],[5,5,5,8],[6,0,6,4],[6,5,6,8],[49,0,53,0],[49,1,53,12],[55,0,69,2],[55,3,56,12],[58,3,59,12],[61,3,62,12],[64,3,69,12]]}
["Mississippi State Department of Health-Bureau of Public Water Supply"]
["Monthly Fluoride Operating Report (MFOR)--DAILY SAMPLE ENTRY FOR JUNE"]
[]
["Water System Name:",{"$nulls":4},{"$f":"INTRO!G3","v":0}]
["PWS ID:",{"$nulls":4},{"$f":"INTRO!G4","v":0},{"$nulls":3},"Email to water.fluoride@msdh.ms.gov by the 10th of each month.  Reports are due every month, even if offline!"]
["Number of Treatment Facilities:",{"$nulls":4},{"$f":"INTRO!H16","v":0}]
["Reporting Year:",{"$nulls":4},{"$f":"SPLITS!F7","v":0}]
[]
["DATE",{"$f":"INTRO!C31","v":0},{"$f":"INTRO!C32","v":0},{"$f":"INTRO!C33","v":0},{"$f":"INTRO!C34","v":0},{"$f":"INTRO!C35","v":0},{"$f":"INTRO!C36","v":0},{"$f":"INTRO!C37","v":0},{"$f":"INTRO!C38","v":0},{"$f":"INTRO!C39","v":0},{"$f":"INTRO!C40","v":0},{"$f":"INTRO!C41","v":0},{"$f":"INTRO!C42","v":0}]
[{"$f":"DATE(INTRO!I4,6,1)","v":"1900-06-01"}]
[{"$f":"IF(MONTH(A10+1)=MONTH(A10),A10+1,\"\")","v":"1900-06-02"}]
[{"$f":"IF(MONTH(A11+1)=MONTH(A11),A11+1,\"\")","v":"1900-06-03"}]
["1900-06-04"]
["1900-06-05"]
["1900-06-06"]
["1900-06-07"]
["1900-06-08"]
["1900-06-09"]
["1900-06-10"]
["1900-06-11"]
["1900-06-12"]
["1900-06-13"]
["1900-06-14"]
["1900-06-15"]
["1900-06-16"]
["1900-06-17"]
["1900-06-18"]
["1900-06-19"]
["1900-06-20"]
["1900-06-21"]
["1900-06-22"]
["1900-06-23"]
["1900-06-24"]
["1900-06-25"]
["1900-06-26"]
["1900-06-27"]
["1900-06-28"]
["1900-06-29"]
["1900-06-30"]
[""]
["AVG",{"$f":"IFERROR(AVERAGE(B10:B40),0)","v":{"v":0,"d":"0.00"}},{"$f":"IFERROR(AVERAGE(C10:C40),0)","v":{"v":0,"d":"0.00"}},{"v":0,"d":"0.00"},{"v":0,"d":"0.00"},{"v":0,"d":"0.00"},{"v":0,"d":"0.00"},{"v":0,"d":"0.00"},{"v":0,"d":"0.00"},{"v":0,"d":"0.00"},{"v":0,"d":"0.00"},{"v":0,"d":"0.00"},{"v":0,"d":"0.00"}]
["MAX",{"$f":"MAX(B10:B40)","v":{"v":0,"d":"0.00"}},{"$f":"MAX(C10:C40)","v":{"v":0,"d":"0.00"}},{"v":0,"d":"0.00"},{"v":0,"d":"0.00"},{"v":0,"d":"0.00"},{"v":0,"d":"0.00"},{"v":0,"d":"0.00"},{"v":0,"d":"0.00"},{"v":0,"d":"0.00"},{"v":0,"d":"0.00"},{"v":0,"d":"0.00"},{"v":0,"d":"0.00"}]
["MIN",{"$f":"MIN(B10:B40)","v":{"v":0,"d":"0.00"}},{"$f":"MIN(C10:C40)","v":{"v":0,"d":"0.00"}},{"v":0,"d":"0.00"},{"v":0,"d":"0.00"},{"v":0,"d":"0.00"},{"v":0,"d":"0.00"},{"v":0,"d":"0.00"},{"v":0,"d":"0.00"},{"v":0,"d":"0.00"},{"v":0,"d":"0.00"},{"v":0,"d":"0.00"},{"v":0,"d":"0.00"}]
["Count",{"$f":"COUNT(B10:B40)","v":0},{"$f":"COUNT(C10:C40)","v":0},0,0,0,0,0,0,0,0,0,0]
["Sufficient Samples",{"$f":"IF(COUNT(B10:B40)>=13, \"YES\", \"NO\")","v":"NO"},{"$f":"IF(COUNT(C10:C40)>=13, \"YES\", \"NO\")","v":"NO"},"NO","NO","NO","NO","NO","NO","NO","NO","NO","NO"]
["Number In-Range",{"$f":"COUNTIFS(B10:B40, \">=0.54\", B10:B40, \"<=1.24\")","v":0},{"$f":"COUNTIFS(C10:C40, \">=0.54\", C10:C40, \"<=1.24\")","v":0},0,0,0,0,0,0,0,0,0,0]
["Sufficient In-Range",{"$f":"IFERROR(IF(COUNTIFS(B10:B40,\">=0.54\",B10:B40,\"<=1.24\")/COUNTA(B10:B40)>=0.9, \"YES\", \"NO\"),\"NA\")","v":"NA"},"NA","NA","NA","NA","NA","NA","NA","NA","NA","NA","NA"]
["Percent In-Range",{"$f":"IFERROR(COUNTIFS(B10:B40,\">=0.54\",B10:B40,\"<=1.24\")/COUNTA(B10:B40),\"NA\")","v":"NA"},"NA","NA","NA","NA","NA","NA","NA","NA","NA","NA","NA"]
[]
["Operator Notes for June"]
[]
[]
[]
[]
[]
["HELPFUL TIPS FOR ANLAYZING FLUORIDE",null,null,"1. Always make sure you DI water is fresh.  Replace it every few months.  You can get free DI water from Water Supply.  Call 601-327-5734 to request DI water.  Save your old bottles to send back."]
[]
[]
[{"$nulls":3},"2. Use a fluoride standard solution when testing fluoride.  Set it up just like you were testing a water sample.  You can get free standard solution from MSDH. Call 601-327-5734 to request standard."]
[]
[]
[{"$nulls":3},"3. Make sure your DI water, standard solution, sample water, reagent, meter, and anything else you use to test fluoride are all the same temperature before analyzing.  Use a thermometer, if needed."]
[]
[]
[{"$nulls":3},"4.  When you are temporarily offline for whatever reason, mark \"OFF\" on each of the days you are offline on your MFOR.  DO NOT collect SPLIT samples while offline.  Instead, send an email to water.fluoride@msdh.ms.gov with the date you have gone offline, the reason, and the estimated startup date.  When you startup again, email water.fluoride@msdh.ms.gov with your startup date.    DO NOT SEND EMPTY BOTTLES TO THE LAB."]

{"sheet":"JUL","index":7,"n_rows":65,"n_cols":13,"rows_kept":65,"merged":[[0,0,0,12],[1,0,1,12],[3,0,3,4],[3,5,3,12],[4,0,4,4],[4,5,4,8],[4,9,6,12],[5,0,5,4],[5,5,5,8],[6,0,6,4],[6,5,6,8],[49,0,53,0],[49,1,53,12],[55,0,69,2],[55,3,56,12],[58,3,59,12],[61,3,62,12],[64,3,69,12]]}
["Mississippi State Department of Health-Bureau of Public Water Supply"]
["Monthly Fluoride Operating Report (MFOR)--DAILY SAMPLE ENTRY FOR JULY"]
[]
["Water System Name:",{"$nulls":4},{"$f":"INTRO!G3","v":0}]
["PWS ID:",{"$nulls":4},{"$f":"INTRO!G4","v":0},{"$nulls":3},"Email to water.fluoride@msdh.ms.gov by the 10th of each month.  Reports are due every month, even if offline!"]
["Number of Treatment Facilities:",{"$nulls":4},{"$f":"INTRO!H16","v":0}]
["Reporting Year:",{"$nulls":4},{"$f":"SPLITS!F7","v":0}]
[]
["DATE",{"$f":"INTRO!C31","v":0},{"$f":"INTRO!C32","v":0},{"$f":"INTRO!C33","v":0},{"$f":"INTRO!C34","v":0},{"$f":"INTRO!C35","v":0},{"$f":"INTRO!C36","v":0},{"$f":"INTRO!C37","v":0},{"$f":"INTRO!C38","v":0},{"$f":"INTRO!C39","v":0},{"$f":"INTRO!C40","v":0},{"$f":"INTRO!C41","v":0},{"$f":"INTRO!C42","v":0}]
[{"$f":"DATE(INTRO!I4,7,1)","v":"1900-07-01"}]
[{"$f":"IF(MONTH(A10+1)=MONTH(A10),A10+1,\"\")","v":"1900-07-02"}]
[{"$f":"IF(MONTH(A11+1)=MONTH(A11),A11+1,\"\")","v":"1900-07-03"}]
["1900-07-04"]
["1900-07-05"]
["1900-07-06"]
["1900-07-07"]
["1900-07-08"]
["1900-07-09"]
["1900-07-10"]
["1900-07-11"]
["1900-07-12"]
["1900-07-13"]
["1900-07-14"]
["1900-07-15"]
["1900-07-16"]
["1900-07-17"]
["1900-07-18"]
["1900-07-19"]
["1900-07-20"]
["1900-07-21"]
["1900-07-22"]
["1900-07-23"]
["1900-07-24"]
["1900-07-25"]
["1900-07-26"]
["1900-07-27"]
["1900-07-28"]
["1900-07-29"]
["1900-07-30"]
["1900-07-31"]
["AVG",{"$f":"IFERROR(AVERAGE(B10:B40),0)","v":{"v":0,"d":"0.00"}},{"$f":"IFERROR(AVERAGE(C10:C40),0)","v":{"v":0,"d":"0.00"}},{"v":0,"d":"0.00"},{"v":0,"d":"0.00"},{"v":0,"d":"0.00"},{"v":0,"d":"0.00"},{"v":0,"d":"0.00"},{"v":0,"d":"0.00"},{"v":0,"d":"0.00"},{"v":0,"d":"0.00"},{"v":0,"d":"0.00"},{"v":0,"d":"0.00"}]
["MAX",{"$f":"MAX(B10:B40)","v":{"v":0,"d":"0.00"}},{"$f":"MAX(C10:C40)","v":{"v":0,"d":"0.00"}},{"v":0,"d":"0.00"},{"v":0,"d":"0.00"},{"v":0,"d":"0.00"},{"v":0,"d":"0.00"},{"v":0,"d":"0.00"},{"v":0,"d":"0.00"},{"v":0,"d":"0.00"},{"v":0,"d":"0.00"},{"v":0,"d":"0.00"},{"v":0,"d":"0.00"}]
["MIN",{"$f":"MIN(B10:B40)","v":{"v":0,"d":"0.00"}},{"$f":"MIN(C10:C40)","v":{"v":0,"d":"0.00"}},{"v":0,"d":"0.00"},{"v":0,"d":"0.00"},{"v":0,"d":"0.00"},{"v":0,"d":"0.00"},{"v":0,"d":"0.00"},{"v":0,"d":"0.00"},{"v":0,"d":"0.00"},{"v":0,"d":"0.00"},{"v":0,"d":"0.00"},{"v":0,"d":"0.00"}]
["Count",{"$f":"COUNT(B10:B40)","v":0},{"$f":"COUNT(C10:C40)","v":0},0,0,0,0,0,0,0,0,0,0]
["Sufficient Samples",{"$f":"IF(COUNT(B10:B40)>=13, \"YES\", \"NO\")","v":"NO"},{"$f":"IF(COUNT(C10:C40)>=13, \"YES\", \"NO\")","v":"NO"},"NO","NO","NO","NO","NO","NO","NO","NO","NO","NO"]
["Number In-Range",{"$f":"COUNTIFS(B10:B40, \">=0.54\", B10:B40, \"<=1.24\")","v":0},{"$f":"COUNTIFS(C10:C40, \">=0.54\", C10:C40, \"<=1.24\")","v":0},0,0,0,0,0,0,0,0,0,0]
["Sufficient In-Range",{"$f":"IFERROR(IF(COUNTIFS(B10:B40,\">=0.54\",B10:B40,\"<=1.24\")/COUNTA(B10:B40)>=0.9, \"YES\", \"NO\"),\"NA\")","v":"NA"},"NA","NA","NA","NA","NA","NA","NA","NA","NA","NA","NA"]
["Percent In-Range",{"$f":"IFERROR(COUNTIFS(B10:B40,\">=0.54\",B10:B40,\"<=1.24\")/COUNTA(B10:B40),\"NA\")","v":"NA"},"NA","NA","NA","NA","NA","NA","NA","NA","NA","NA","NA"]
[]
["Operator Notes for July"]
[]
[]
[]
[]
[]
["HELPFUL TIPS FOR ANLAYZING FLUORIDE",null,null,"1. Always make sure you DI water is fresh.  Replace it every few months.  You can get free DI water from Water Supply.  Call 601-327-5734 to request DI water.  Save your old bottles to send back."]
[]
[]
[{"$nulls":3},"2. Use a fluoride standard solution when testing fluoride.  Set it up just like you were testing a water sample.  You can get free standard solution from MSDH. Call 601-327-5734 to request standard."]
[]
[]
[{"$nulls":3},"3. Make sure your DI water, standard solution, sample water, reagent, meter, and anything else you use to test fluoride are all the same temperature before analyzing.  Use a thermometer, if needed."]
[]
[]
[{"$nulls":3},"4.  When you are temporarily offline for whatever reason, mark \"OFF\" on each of the days you are offline on your MFOR.  DO NOT collect SPLIT samples while offline.  Instead, send an email to water.fluoride@msdh.ms.gov with the date you have gone offline, the reason, and the estimated startup date.  When you startup again, email water.fluoride@msdh.ms.gov with your startup date.    DO NOT SEND EMPTY BOTTLES TO THE LAB."]

{"sheet":"AUG","index":8,"n_rows":65,"n_cols":13,"rows_kept":65,"merged":[[0,0,0,12],[1,0,1,12],[3,0,3,4],[3,5,3,12],[4,0,4,4],[4,5,4,8],[4,9,6,12],[5,0,5,4],[5,5,5,8],[6,0,6,4],[6,5,6,8],[49,0,53,0],[49,1,53,12],[55,0,69,2],[55,3,56,12],[58,3,59,12],[61,3,62,12],[64,3,69,12]]}
["Mississippi State Department of Health-Bureau of Public Water Supply"]
["Monthly Fluoride Operating Report (MFOR)--DAILY SAMPLE ENTRY FOR AUGUST"]
[]
["Water System Name:",{"$nulls":4},{"$f":"INTRO!G3","v":0}]
["PWS ID:",{"$nulls":4},{"$f":"INTRO!G4","v":0},{"$nulls":3},"Email to water.fluoride@msdh.ms.gov by the 10th of each month.  Reports are due every month, even if offline!"]
["Number of Treatment Facilities:",{"$nulls":4},{"$f":"INTRO!H16","v":0}]
["Reporting Year:",{"$nulls":4},{"$f":"SPLITS!F7","v":0}]
[]
["DATE",{"$f":"INTRO!C31","v":0},{"$f":"INTRO!C32","v":0},{"$f":"INTRO!C33","v":0},{"$f":"INTRO!C34","v":0},{"$f":"INTRO!C35","v":0},{"$f":"INTRO!C36","v":0},{"$f":"INTRO!C37","v":0},{"$f":"INTRO!C38","v":0},{"$f":"INTRO!C39","v":0},{"$f":"INTRO!C40","v":0},{"$f":"INTRO!C41","v":0},{"$f":"INTRO!C42","v":0}]
[{"$f":"DATE(INTRO!I4,8,1)","v":"1900-08-01"}]
[{"$f":"IF(MONTH(A10+1)=MONTH(A10),A10+1,\"\")","v":"1900-08-02"}]
[{"$f":"IF(MONTH(A11+1)=MONTH(A11),A11+1,\"\")","v":"1900-08-03"}]
["1900-08-04"]
["1900-08-05"]
["1900-08-06"]
["1900-08-07"]
["1900-08-08"]
["1900-08-09"]
["1900-08-10"]
["1900-08-11"]
["1900-08-12"]
["1900-08-13"]
["1900-08-14"]
["1900-08-15"]
["1900-08-16"]
["1900-08-17"]
["1900-08-18"]
["1900-08-19"]
["1900-08-20"]
["1900-08-21"]
["1900-08-22"]
["1900-08-23"]
["1900-08-24"]
["1900-08-25"]
["1900-08-26"]
["1900-08-27"]
["1900-08-28"]
["1900-08-29"]
["1900-08-30"]
["1900-08-31"]
["AVG",{"$f":"IFERROR(AVERAGE(B10:B40),0)","v":{"v":0,"d":"0.00"}},{"$f":"IFERROR(AVERAGE(C10:C40),0)","v":{"v":0,"d":"0.00"}},{"v":0,"d":"0.00"},{"v":0,"d":"0.00"},{"v":0,"d":"0.00"},{"v":0,"d":"0.00"},{"v":0,"d":"0.00"},{"v":0,"d":"0.00"},{"v":0,"d":"0.00"},{"v":0,"d":"0.00"},{"v":0,"d":"0.00"},{"v":0,"d":"0.00"}]
["MAX",{"$f":"MAX(B10:B40)","v":{"v":0,"d":"0.00"}},{"$f":"MAX(C10:C40)","v":{"v":0,"d":"0.00"}},{"v":0,"d":"0.00"},{"v":0,"d":"0.00"},{"v":0,"d":"0.00"},{"v":0,"d":"0.00"},{"v":0,"d":"0.00"},{"v":0,"d":"0.00"},{"v":0,"d":"0.00"},{"v":0,"d":"0.00"},{"v":0,"d":"0.00"},{"v":0,"d":"0.00"}]
["MIN",{"$f":"MIN(B10:B40)","v":{"v":0,"d":"0.00"}},{"$f":"MIN(C10:C40)","v":{"v":0,"d":"0.00"}},{"v":0,"d":"0.00"},{"v":0,"d":"0.00"},{"v":0,"d":"0.00"},{"v":0,"d":"0.00"},{"v":0,"d":"0.00"},{"v":0,"d":"0.00"},{"v":0,"d":"0.00"},{"v":0,"d":"0.00"},{"v":0,"d":"0.00"},{"v":0,"d":"0.00"}]
["Count",{"$f":"COUNT(B10:B40)","v":0},{"$f":"COUNT(C10:C40)","v":0},0,0,0,0,0,0,0,0,0,0]
["Sufficient Samples",{"$f":"IF(COUNT(B10:B40)>=13, \"YES\", \"NO\")","v":"NO"},{"$f":"IF(COUNT(C10:C40)>=13, \"YES\", \"NO\")","v":"NO"},"NO","NO","NO","NO","NO","NO","NO","NO","NO","NO"]
["Number In-Range",{"$f":"COUNTIFS(B10:B40, \">=0.54\", B10:B40, \"<=1.24\")","v":0},{"$f":"COUNTIFS(C10:C40, \">=0.54\", C10:C40, \"<=1.24\")","v":0},0,0,0,0,0,0,0,0,0,0]
["Sufficient In-Range",{"$f":"IFERROR(IF(COUNTIFS(B10:B40,\">=0.54\",B10:B40,\"<=1.24\")/COUNTA(B10:B40)>=0.9, \"YES\", \"NO\"),\"NA\")","v":"NA"},"NA","NA","NA","NA","NA","NA","NA","NA","NA","NA","NA"]
["Percent In-Range",{"$f":"IFERROR(COUNTIFS(B10:B40,\">=0.54\",B10:B40,\"<=1.24\")/COUNTA(B10:B40),\"NA\")","v":"NA"},"NA","NA","NA","NA","NA","NA","NA","NA","NA","NA","NA"]
[]
["Operator Notes for August"]
[]
[]
[]
[]
[]
["HELPFUL TIPS FOR ANLAYZING FLUORIDE",null,null,"1. Always make sure you DI water is fresh.  Replace it every few months.  You can get free DI water from Water Supply.  Call 601-327-5734 to request DI water.  Save your old bottles to send back."]
[]
[]
[{"$nulls":3},"2. Use a fluoride standard solution when testing fluoride.  Set it up just like you were testing a water sample.  You can get free standard solution from MSDH. Call 601-327-5734 to request standard."]
[]
[]
[{"$nulls":3},"3. Make sure your DI water, standard solution, sample water, reagent, meter, and anything else you use to test fluoride are all the same temperature before analyzing.  Use a thermometer, if needed."]
[]
[]
[{"$nulls":3},"4.  When you are temporarily offline for whatever reason, mark \"OFF\" on each of the days you are offline on your MFOR.  DO NOT collect SPLIT samples while offline.  Instead, send an email to water.fluoride@msdh.ms.gov with the date you have gone offline, the reason, and the estimated startup date.  When you startup again, email water.fluoride@msdh.ms.gov with your startup date.    DO NOT SEND EMPTY BOTTLES TO THE LAB."]

{"sheet":"SEP","index":9,"n_rows":65,"n_cols":13,"rows_kept":65,"merged":[[0,0,0,12],[1,0,1,12],[3,0,3,4],[3,5,3,12],[4,0,4,4],[4,5,4,8],[4,9,6,12],[5,0,5,4],[5,5,5,8],[6,0,6,4],[6,5,6,8],[49,0,53,0],[49,1,53,12],[55,0,69,2],[55,3,56,12],[58,3,59,12],[61,3,62,12],[64,3,69,12]]}
["Mississippi State Department of Health-Bureau of Public Water Supply"]
["Monthly Fluoride Operating Report (MFOR)--DAILY SAMPLE ENTRY FOR SEPTEMBER"]
[]
["Water System Name:",{"$nulls":4},{"$f":"INTRO!G3","v":0}]
["PWS ID:",{"$nulls":4},{"$f":"INTRO!G4","v":0},{"$nulls":3},"Email to water.fluoride@msdh.ms.gov by the 10th of each month.  Reports are due every month, even if offline!"]
["Number of Treatment Facilities:",{"$nulls":4},{"$f":"INTRO!H16","v":0}]
["Reporting Year:",{"$nulls":4},{"$f":"SPLITS!F7","v":0}]
[]
["DATE",{"$f":"INTRO!C31","v":0},{"$f":"INTRO!C32","v":0},{"$f":"INTRO!C33","v":0},{"$f":"INTRO!C34","v":0},{"$f":"INTRO!C35","v":0},{"$f":"INTRO!C36","v":0},{"$f":"INTRO!C37","v":0},{"$f":"INTRO!C38","v":0},{"$f":"INTRO!C39","v":0},{"$f":"INTRO!C40","v":0},{"$f":"INTRO!C41","v":0},{"$f":"INTRO!C42","v":0}]
[{"$f":"DATE(INTRO!I4,9,1)","v":"1900-09-01"}]
[{"$f":"IF(MONTH(A10+1)=MONTH(A10),A10+1,\"\")","v":"1900-09-02"}]
[{"$f":"IF(MONTH(A11+1)=MONTH(A11),A11+1,\"\")","v":"1900-09-03"}]
["1900-09-04"]
["1900-09-05"]
["1900-09-06"]
["1900-09-07"]
["1900-09-08"]
["1900-09-09"]
["1900-09-10"]
["1900-09-11"]
["1900-09-12"]
["1900-09-13"]
["1900-09-14"]
["1900-09-15"]
["1900-09-16"]
["1900-09-17"]
["1900-09-18"]
["1900-09-19"]
["1900-09-20"]
["1900-09-21"]
["1900-09-22"]
["1900-09-23"]
["1900-09-24"]
["1900-09-25"]
["1900-09-26"]
["1900-09-27"]
["1900-09-28"]
["1900-09-29"]
["1900-09-30"]
[""]
["AVG",{"$f":"IFERROR(AVERAGE(B10:B40),0)","v":{"v":0,"d":"0.00"}},{"$f":"IFERROR(AVERAGE(C10:C40),0)","v":{"v":0,"d":"0.00"}},{"v":0,"d":"0.00"},{"v":0,"d":"0.00"},{"v":0,"d":"0.00"},{"v":0,"d":"0.00"},{"v":0,"d":"0.00"},{"v":0,"d":"0.00"},{"v":0,"d":"0.00"},{"v":0,"d":"0.00"},{"v":0,"d":"0.00"},{"v":0,"d":"0.00"}]
["MAX",{"$f":"MAX(B10:B40)","v":{"v":0,"d":"0.00"}},{"$f":"MAX(C10:C40)","v":{"v":0,"d":"0.00"}},{"v":0,"d":"0.00"},{"v":0,"d":"0.00"},{"v":0,"d":"0.00"},{"v":0,"d":"0.00"},{"v":0,"d":"0.00"},{"v":0,"d":"0.00"},{"v":0,"d":"0.00"},{"v":0,"d":"0.00"},{"v":0,"d":"0.00"},{"v":0,"d":"0.00"}]
["MIN",{"$f":"MIN(B10:B40)","v":{"v":0,"d":"0.00"}},{"$f":"MIN(C10:C40)","v":{"v":0,"d":"0.00"}},{"v":0,"d":"0.00"},{"v":0,"d":"0.00"},{"v":0,"d":"0.00"},{"v":0,"d":"0.00"},{"v":0,"d":"0.00"},{"v":0,"d":"0.00"},{"v":0,"d":"0.00"},{"v":0,"d":"0.00"},{"v":0,"d":"0.00"},{"v":0,"d":"0.00"}]
["Count",{"$f":"COUNT(B10:B40)","v":0},{"$f":"COUNT(C10:C40)","v":0},0,0,0,0,0,0,0,0,0,0]
["Sufficient Samples",{"$f":"IF(COUNT(B10:B40)>=13, \"YES\", \"NO\")","v":"NO"},{"$f":"IF(COUNT(C10:C40)>=13, \"YES\", \"NO\")","v":"NO"},"NO","NO","NO","NO","NO","NO","NO","NO","NO","NO"]
["Number In-Range",{"$f":"COUNTIFS(B10:B40, \">=0.54\", B10:B40, \"<=1.24\")","v":0},{"$f":"COUNTIFS(C10:C40, \">=0.54\", C10:C40, \"<=1.24\")","v":0},0,0,0,0,0,0,0,0,0,0]
["Sufficient In-Range",{"$f":"IFERROR(IF(COUNTIFS(B10:B40,\">=0.54\",B10:B40,\"<=1.24\")/COUNTA(B10:B40)>=0.9, \"YES\", \"NO\"),\"NA\")","v":"NA"},"NA","NA","NA","NA","NA","NA","NA","NA","NA","NA","NA"]
["Percent In-Range",{"$f":"IFERROR(COUNTIFS(B10:B40,\">=0.54\",B10:B40,\"<=1.24\")/COUNTA(B10:B40),\"NA\")","v":"NA"},"NA","NA","NA","NA","NA","NA","NA","NA","NA","NA","NA"]
[]
["Operator Notes for September"]
[]
[]
[]
[]
[]
["HELPFUL TIPS FOR ANLAYZING FLUORIDE",null,null,"1. Always make sure you DI water is fresh.  Replace it every few months.  You can get free DI water from Water Supply.  Call 601-327-5734 to request DI water.  Save your old bottles to send back."]
[]
[]
[{"$nulls":3},"2. Use a fluoride standard solution when testing fluoride.  Set it up just like you were testing a water sample.  You can get free standard solution from MSDH. Call 601-327-5734 to request standard."]
[]
[]
[{"$nulls":3},"3. Make sure your DI water, standard solution, sample water, reagent, meter, and anything else you use to test fluoride are all the same temperature before analyzing.  Use a thermometer, if needed."]
[]
[]
[{"$nulls":3},"4.  When you are temporarily offline for whatever reason, mark \"OFF\" on each of the days you are offline on your MFOR.  DO NOT collect SPLIT samples while offline.  Instead, send an email to water.fluoride@msdh.ms.gov with the date you have gone offline, the reason, and the estimated startup date.  When you startup again, email water.fluoride@msdh.ms.gov with your startup date.    DO NOT SEND EMPTY BOTTLES TO THE LAB."]

{"sheet":"OCT","index":10,"n_rows":65,"n_cols":13,"rows_kept":65,"merged":[[0,0,0,12],[1,0,1,12],[3,0,3,4],[3,5,3,12],[4,0,4,4],[4,5,4,8],[4,9,6,12],[5,0,5,4],[5,5,5,8],[6,0,6,4],[6,5,6,8],[49,0,53,0],[49,1,53,12],[55,0,69,2],[55,3,56,12],[58,3,59,12],[61,3,62,12],[64,3,69,12]]}
["Mississippi State Department of Health-Bureau of Public Water Supply"]
["Monthly Fluoride Operating Report (MFOR)--DAILY SAMPLE ENTRY FOR OCTOBER"]
[]
["Water System Name:",{"$nulls":4},{"$f":"INTRO!G3","v":0}]
["PWS ID:",{"$nulls":4},{"$f":"INTRO!G4","v":0},{"$nulls":3},"Email to water.fluoride@msdh.ms.gov by the 10th of each month.  Reports are due every month, even if offline!"]
["Number of Treatment Facilities:",{"$nulls":4},{"$f":"INTRO!H16","v":0}]
["Reporting Year:",{"$nulls":4},{"$f":"SPLITS!F7","v":0}]
[]
["DATE",{"$f":"INTRO!C31","v":0},{"$f":"INTRO!C32","v":0},{"$f":"INTRO!C33","v":0},{"$f":"INTRO!C34","v":0},{"$f":"INTRO!C35","v":0},{"$f":"INTRO!C36","v":0},{"$f":"INTRO!C37","v":0},{"$f":"INTRO!C38","v":0},{"$f":"INTRO!C39","v":0},{"$f":"INTRO!C40","v":0},{"$f":"INTRO!C41","v":0},{"$f":"INTRO!C42","v":0}]
[{"$f":"DATE(INTRO!I4,10,1)","v":"1900-10-01"}]
[{"$f":"IF(MONTH(A10+1)=MONTH(A10),A10+1,\"\")","v":"1900-10-02"}]
[{"$f":"IF(MONTH(A11+1)=MONTH(A11),A11+1,\"\")","v":"1900-10-03"}]
["1900-10-04"]
["1900-10-05"]
["1900-10-06"]
["1900-10-07"]
["1900-10-08"]
["1900-10-09"]
["1900-10-10"]
["1900-10-11"]
["1900-10-12"]
["1900-10-13"]
["1900-10-14"]
["1900-10-15"]
["1900-10-16"]
["1900-10-17"]
["1900-10-18"]
["1900-10-19"]
["1900-10-20"]
["1900-10-21"]
["1900-10-22"]
["1900-10-23"]
["1900-10-24"]
["1900-10-25"]
["1900-10-26"]
["1900-10-27"]
["1900-10-28"]
["1900-10-29"]
["1900-10-30"]
["1900-10-31"]
["AVG",{"$f":"IFERROR(AVERAGE(B10:B40),0)","v":{"v":0,"d":"0.00"}},{"$f":"IFERROR(AVERAGE(C10:C40),0)","v":{"v":0,"d":"0.00"}},{"v":0,"d":"0.00"},{"v":0,"d":"0.00"},{"v":0,"d":"0.00"},{"v":0,"d":"0.00"},{"v":0,"d":"0.00"},{"v":0,"d":"0.00"},{"v":0,"d":"0.00"},{"v":0,"d":"0.00"},{"v":0,"d":"0.00"},{"v":0,"d":"0.00"}]
["MAX",{"$f":"MAX(B10:B40)","v":{"v":0,"d":"0.00"}},{"$f":"MAX(C10:C40)","v":{"v":0,"d":"0.00"}},{"v":0,"d":"0.00"},{"v":0,"d":"0.00"},{"v":0,"d":"0.00"},{"v":0,"d":"0.00"},{"v":0,"d":"0.00"},{"v":0,"d":"0.00"},{"v":0,"d":"0.00"},{"v":0,"d":"0.00"},{"v":0,"d":"0.00"},{"v":0,"d":"0.00"}]
["MIN",{"$f":"MIN(B10:B40)","v":{"v":0,"d":"0.00"}},{"$f":"MIN(C10:C40)","v":{"v":0,"d":"0.00"}},{"v":0,"d":"0.00"},{"v":0,"d":"0.00"},{"v":0,"d":"0.00"},{"v":0,"d":"0.00"},{"v":0,"d":"0.00"},{"v":0,"d":"0.00"},{"v":0,"d":"0.00"},{"v":0,"d":"0.00"},{"v":0,"d":"0.00"},{"v":0,"d":"0.00"}]
["Count",{"$f":"COUNT(B10:B40)","v":0},{"$f":"COUNT(C10:C40)","v":0},0,0,0,0,0,0,0,0,0,0]
["Sufficient Samples",{"$f":"IF(COUNT(B10:B40)>=13, \"YES\", \"NO\")","v":"NO"},{"$f":"IF(COUNT(C10:C40)>=13, \"YES\", \"NO\")","v":"NO"},"NO","NO","NO","NO","NO","NO","NO","NO","NO","NO"]
["Number In-Range",{"$f":"COUNTIFS(B10:B40, \">=0.54\", B10:B40, \"<=1.24\")","v":0},{"$f":"COUNTIFS(C10:C40, \">=0.54\", C10:C40, \"<=1.24\")","v":0},0,0,0,0,0,0,0,0,0,0]
["Sufficient In-Range",{"$f":"IFERROR(IF(COUNTIFS(B10:B40,\">=0.54\",B10:B40,\"<=1.24\")/COUNTA(B10:B40)>=0.9, \"YES\", \"NO\"),\"NA\")","v":"NA"},"NA","NA","NA","NA","NA","NA","NA","NA","NA","NA","NA"]
["Percent In-Range",{"$f":"IFERROR(COUNTIFS(B10:B40,\">=0.54\",B10:B40,\"<=1.24\")/COUNTA(B10:B40),\"NA\")","v":"NA"},"NA","NA","NA","NA","NA","NA","NA","NA","NA","NA","NA"]
[]
["Operator Notes for October"]
[]
[]
[]
[]
[]
["HELPFUL TIPS FOR ANLAYZING FLUORIDE",null,null,"1. Always make sure you DI water is fresh.  Replace it every few months.  You can get free DI water from Water Supply.  Call 601-327-5734 to request DI water.  Save your old bottles to send back."]
[]
[]
[{"$nulls":3},"2. Use a fluoride standard solution when testing fluoride.  Set it up just like you were testing a water sample.  You can get free standard solution from MSDH. Call 601-327-5734 to request standard."]
[]
[]
[{"$nulls":3},"3. Make sure your DI water, standard solution, sample water, reagent, meter, and anything else you use to test fluoride are all the same temperature before analyzing.  Use a thermometer, if needed."]
[]
[]
[{"$nulls":3},"4.  When you are temporarily offline for whatever reason, mark \"OFF\" on each of the days you are offline on your MFOR.  DO NOT collect SPLIT samples while offline.  Instead, send an email to water.fluoride@msdh.ms.gov with the date you have gone offline, the reason, and the estimated startup date.  When you startup again, email water.fluoride@msdh.ms.gov with your startup date.    DO NOT SEND EMPTY BOTTLES TO THE LAB."]

{"sheet":"NOV","index":11,"n_rows":65,"n_cols":13,"rows_kept":65,"merged":[[0,0,0,12],[1,0,1,12],[3,0,3,4],[3,5,3,12],[4,0,4,4],[4,5,4,8],[4,9,6,12],[5,0,5,4],[5,5,5,8],[6,0,6,4],[6,5,6,8],[49,0,53,0],[49,1,53,12],[55,0,69,2],[55,3,56,12],[58,3,59,12],[61,3,62,12],[64,3,69,12]]}
["Mississippi State Department of Health-Bureau of Public Water Supply"]
["Monthly Fluoride Operating Report (MFOR)--DAILY SAMPLE ENTRY FOR NOVEMBER"]
[]
["Water System Name:",{"$nulls":4},{"$f":"INTRO!G3","v":0}]
["PWS ID:",{"$nulls":4},{"$f":"INTRO!G4","v":0},{"$nulls":3},"Email to water.fluoride@msdh.ms.gov by the 10th of each month.  Reports are due every month, even if offline!"]
["Number of Treatment Facilities:",{"$nulls":4},{"$f":"INTRO!H16","v":0}]
["Reporting Year:",{"$nulls":4},{"$f":"SPLITS!F7","v":0}]
[]
["DATE",{"$f":"INTRO!C31","v":0},{"$f":"INTRO!C32","v":0},{"$f":"INTRO!C33","v":0},{"$f":"INTRO!C34","v":0},{"$f":"INTRO!C35","v":0},{"$f":"INTRO!C36","v":0},{"$f":"INTRO!C37","v":0},{"$f":"INTRO!C38","v":0},{"$f":"INTRO!C39","v":0},{"$f":"INTRO!C40","v":0},{"$f":"INTRO!C41","v":0},{"$f":"INTRO!C42","v":0}]
[{"$f":"DATE(INTRO!I4,11,1)","v":"1900-11-01"}]
[{"$f":"IF(MONTH(A10+1)=MONTH(A10),A10+1,\"\")","v":"1900-11-02"}]
[{"$f":"IF(MONTH(A11+1)=MONTH(A11),A11+1,\"\")","v":"1900-11-03"}]
["1900-11-04"]
["1900-11-05"]
["1900-11-06"]
["1900-11-07"]
["1900-11-08"]
["1900-11-09"]
["1900-11-10"]
["1900-11-11"]
["1900-11-12"]
["1900-11-13"]
["1900-11-14"]
["1900-11-15"]
["1900-11-16"]
["1900-11-17"]
["1900-11-18"]
["1900-11-19"]
["1900-11-20"]
["1900-11-21"]
["1900-11-22"]
["1900-11-23"]
["1900-11-24"]
["1900-11-25"]
["1900-11-26"]
["1900-11-27"]
["1900-11-28"]
["1900-11-29"]
["1900-11-30"]
[""]
["AVG",{"$f":"IFERROR(AVERAGE(B10:B40),0)","v":{"v":0,"d":"0.00"}},{"$f":"IFERROR(AVERAGE(C10:C40),0)","v":{"v":0,"d":"0.00"}},{"v":0,"d":"0.00"},{"v":0,"d":"0.00"},{"v":0,"d":"0.00"},{"v":0,"d":"0.00"},{"v":0,"d":"0.00"},{"v":0,"d":"0.00"},{"v":0,"d":"0.00"},{"v":0,"d":"0.00"},{"v":0,"d":"0.00"},{"v":0,"d":"0.00"}]
["MAX",{"$f":"MAX(B10:B40)","v":{"v":0,"d":"0.00"}},{"$f":"MAX(C10:C40)","v":{"v":0,"d":"0.00"}},{"v":0,"d":"0.00"},{"v":0,"d":"0.00"},{"v":0,"d":"0.00"},{"v":0,"d":"0.00"},{"v":0,"d":"0.00"},{"v":0,"d":"0.00"},{"v":0,"d":"0.00"},{"v":0,"d":"0.00"},{"v":0,"d":"0.00"},{"v":0,"d":"0.00"}]
["MIN",{"$f":"MIN(B10:B40)","v":{"v":0,"d":"0.00"}},{"$f":"MIN(C10:C40)","v":{"v":0,"d":"0.00"}},{"v":0,"d":"0.00"},{"v":0,"d":"0.00"},{"v":0,"d":"0.00"},{"v":0,"d":"0.00"},{"v":0,"d":"0.00"},{"v":0,"d":"0.00"},{"v":0,"d":"0.00"},{"v":0,"d":"0.00"},{"v":0,"d":"0.00"},{"v":0,"d":"0.00"}]
["Count",{"$f":"COUNT(B10:B40)","v":0},{"$f":"COUNT(C10:C40)","v":0},0,0,0,0,0,0,0,0,0,0]
["Sufficient Samples",{"$f":"IF(COUNT(B10:B40)>=13, \"YES\", \"NO\")","v":"NO"},{"$f":"IF(COUNT(C10:C40)>=13, \"YES\", \"NO\")","v":"NO"},"NO","NO","NO","NO","NO","NO","NO","NO","NO","NO"]
["Number In-Range",{"$f":"COUNTIFS(B10:B40, \">=0.54\", B10:B40, \"<=1.24\")","v":0},{"$f":"COUNTIFS(C10:C40, \">=0.54\", C10:C40, \"<=1.24\")","v":0},0,0,0,0,0,0,0,0,0,0]
["Sufficient In-Range",{"$f":"IFERROR(IF(COUNTIFS(B10:B40,\">=0.54\",B10:B40,\"<=1.24\")/COUNTA(B10:B40)>=0.9, \"YES\", \"NO\"),\"NA\")","v":"NA"},"NA","NA","NA","NA","NA","NA","NA","NA","NA","NA","NA"]
["Percent In-Range",{"$f":"IFERROR(COUNTIFS(B10:B40,\">=0.54\",B10:B40,\"<=1.24\")/COUNTA(B10:B40),\"NA\")","v":"NA"},"NA","NA","NA","NA","NA","NA","NA","NA","NA","NA","NA"]
[]
["Operator Notes for November"]
[]
[]
[]
[]
[]
["HELPFUL TIPS FOR ANLAYZING FLUORIDE",null,null,"1. Always make sure you DI water is fresh.  Replace it every few months.  You can get free DI water from Water Supply.  Call 601-327-5734 to request DI water.  Save your old bottles to send back."]
[]
[]
[{"$nulls":3},"2. Use a fluoride standard solution when testing fluoride.  Set it up just like you were testing a water sample.  You can get free standard solution from MSDH. Call 601-327-5734 to request standard."]
[]
[]
[{"$nulls":3},"3. Make sure your DI water, standard solution, sample water, reagent, meter, and anything else you use to test fluoride are all the same temperature before analyzing.  Use a thermometer, if needed."]
[]
[]
[{"$nulls":3},"4.  When you are temporarily offline for whatever reason, mark \"OFF\" on each of the days you are offline on your MFOR.  DO NOT collect SPLIT samples while offline.  Instead, send an email to water.fluoride@msdh.ms.gov with the date you have gone offline, the reason, and the estimated startup date.  When you startup again, email water.fluoride@msdh.ms.gov with your startup date.    DO NOT SEND EMPTY BOTTLES TO THE LAB."]

{"sheet":"DEC","index":12,"n_rows":65,"n_cols":13,"rows_kept":65,"merged":[[0,0,0,12],[1,0,1,12],[3,0,3,4],[3,5,3,12],[4,0,4,4],[4,5,4,8],[4,9,6,12],[5,0,5,4],[5,5,5,8],[6,0,6,4],[6,5,6,8],[49,0,53,0],[49,1,53,12],[55,0,69,2],[55,3,56,12],[58,3,59,12],[61,3,62,12],[64,3,69,12]]}
["Mississippi State Department of Health-Bureau of Public Water Supply"]
["Monthly Fluoride Operating Report (MFOR)--DAILY SAMPLE ENTRY FOR DECEMBER"]
[]
["Water System Name:",{"$nulls":4},{"$f":"INTRO!G3","v":0}]
["PWS ID:",{"$nulls":4},{"$f":"INTRO!G4","v":0},{"$nulls":3},"Email to water.fluoride@msdh.ms.gov by the 10th of each month.  Reports are due every month, even if offline!"]
["Number of Treatment Facilities:",{"$nulls":4},{"$f":"INTRO!H16","v":0}]
["Reporting Year:",{"$nulls":4},{"$f":"SPLITS!F7","v":0}]
[]
["DATE",{"$f":"INTRO!C31","v":0},{"$f":"INTRO!C32","v":0},{"$f":"INTRO!C33","v":0},{"$f":"INTRO!C34","v":0},{"$f":"INTRO!C35","v":0},{"$f":"INTRO!C36","v":0},{"$f":"INTRO!C37","v":0},{"$f":"INTRO!C38","v":0},{"$f":"INTRO!C39","v":0},{"$f":"INTRO!C40","v":0},{"$f":"INTRO!C41","v":0},{"$f":"INTRO!C42","v":0}]
[{"$f":"DATE(INTRO!I4,12,1)","v":"1900-12-01"}]
[{"$f":"IF(MONTH(A10+1)=MONTH(A10),A10+1,\"\")","v":"1900-12-02"}]
[{"$f":"IF(MONTH(A11+1)=MONTH(A11),A11+1,\"\")","v":"1900-12-03"}]
["1900-12-04"]
["1900-12-05"]
["1900-12-06"]
["1900-12-07"]
["1900-12-08"]
["1900-12-09"]
["1900-12-10"]
["1900-12-11"]
["1900-12-12"]
["1900-12-13"]
["1900-12-14"]
["1900-12-15"]
["1900-12-16"]
["1900-12-17"]
["1900-12-18"]
["1900-12-19"]
["1900-12-20"]
["1900-12-21"]
["1900-12-22"]
["1900-12-23"]
["1900-12-24"]
["1900-12-25"]
["1900-12-26"]
["1900-12-27"]
["1900-12-28"]
["1900-12-29"]
["1900-12-30"]
["1900-12-31"]
["AVG",{"$f":"IFERROR(AVERAGE(B10:B40),0)","v":{"v":0,"d":"0.00"}},{"$f":"IFERROR(AVERAGE(C10:C40),0)","v":{"v":0,"d":"0.00"}},{"v":0,"d":"0.00"},{"v":0,"d":"0.00"},{"v":0,"d":"0.00"},{"v":0,"d":"0.00"},{"v":0,"d":"0.00"},{"v":0,"d":"0.00"},{"v":0,"d":"0.00"},{"v":0,"d":"0.00"},{"v":0,"d":"0.00"},{"v":0,"d":"0.00"}]
["MAX",{"$f":"MAX(B10:B40)","v":{"v":0,"d":"0.00"}},{"$f":"MAX(C10:C40)","v":{"v":0,"d":"0.00"}},{"v":0,"d":"0.00"},{"v":0,"d":"0.00"},{"v":0,"d":"0.00"},{"v":0,"d":"0.00"},{"v":0,"d":"0.00"},{"v":0,"d":"0.00"},{"v":0,"d":"0.00"},{"v":0,"d":"0.00"},{"v":0,"d":"0.00"},{"v":0,"d":"0.00"}]
["MIN",{"$f":"MIN(B10:B40)","v":{"v":0,"d":"0.00"}},{"$f":"MIN(C10:C40)","v":{"v":0,"d":"0.00"}},{"v":0,"d":"0.00"},{"v":0,"d":"0.00"},{"v":0,"d":"0.00"},{"v":0,"d":"0.00"},{"v":0,"d":"0.00"},{"v":0,"d":"0.00"},{"v":0,"d":"0.00"},{"v":0,"d":"0.00"},{"v":0,"d":"0.00"},{"v":0,"d":"0.00"}]
["Count",{"$f":"COUNT(B10:B40)","v":0},{"$f":"COUNT(C10:C40)","v":0},0,0,0,0,0,0,0,0,0,0]
["Sufficient Samples",{"$f":"IF(COUNT(B10:B40)>=13, \"YES\", \"NO\")","v":"NO"},{"$f":"IF(COUNT(C10:C40)>=13, \"YES\", \"NO\")","v":"NO"},"NO","NO","NO","NO","NO","NO","NO","NO","NO","NO"]
["Number In-Range",{"$f":"COUNTIFS(B10:B40, \">=0.54\", B10:B40, \"<=1.24\")","v":0},{"$f":"COUNTIFS(C10:C40, \">=0.54\", C10:C40, \"<=1.24\")","v":0},0,0,0,0,0,0,0,0,0,0]
["Sufficient In-Range",{"$f":"IFERROR(IF(COUNTIFS(B10:B40,\">=0.54\",B10:B40,\"<=1.24\")/COUNTA(B10:B40)>=0.9, \"YES\", \"NO\"),\"NA\")","v":"NA"},"NA","NA","NA","NA","NA","NA","NA","NA","NA","NA","NA"]
["Percent In-Range",{"$f":"IFERROR(COUNTIFS(B10:B40,\">=0.54\",B10:B40,\"<=1.24\")/COUNTA(B10:B40),\"NA\")","v":"NA"},"NA","NA","NA","NA","NA","NA","NA","NA","NA","NA","NA"]
[]
["Operator Notes for December"]
[]
[]
[]
[]
[]
["HELPFUL TIPS FOR ANLAYZING FLUORIDE",null,null,"1. Always make sure you DI water is fresh.  Replace it every few months.  You can get free DI water from Water Supply.  Call 601-327-5734 to request DI water.  Save your old bottles to send back."]
[]
[]
[{"$nulls":3},"2. Use a fluoride standard solution when testing fluoride.  Set it up just like you were testing a water sample.  You can get free standard solution from MSDH. Call 601-327-5734 to request standard."]
[]
[]
[{"$nulls":3},"3. Make sure your DI water, standard solution, sample water, reagent, meter, and anything else you use to test fluoride are all the same temperature before analyzing.  Use a thermometer, if needed."]
[]
[]
[{"$nulls":3},"4.  When you are temporarily offline for whatever reason, mark \"OFF\" on each of the days you are offline on your MFOR.  DO NOT collect SPLIT samples while offline.  Instead, send an email to water.fluoride@msdh.ms.gov with the date you have gone offline, the reason, and the estimated startup date.  When you startup again, email water.fluoride@msdh.ms.gov with your startup date.    DO NOT SEND EMPTY BOTTLES TO THE LAB."]

{"sheet":"SPLITS","index":13,"n_rows":43,"n_cols":38,"rows_kept":43,"merged":[[0,0,0,17],[0,19,0,37],[1,0,1,17],[1,19,1,37],[3,0,3,4],[3,5,3,13],[3,19,3,23],[3,24,3,32],[4,0,4,4],[4,5,4,8],[4,19,4,23],[4,24,4,27],[5,0,5,4],[5,5,5,8],[5,10,6,17],[5,19,5,23],[5,24,5,27],[5,29,6,37],[6,0,6,4],[6,5,6,8],[6,19,6,23],[6,24,6,27],[8,0,11,0],[8,1,9,3],[8,4,9,6],[8,7,9,9],[8,10,9,12],[8,13,9,15],[8,16,9,18],[8,19,11,19],[8,20,9,22],[8,23,9,25],[8,26,9,28],[8,29,9,31],[8,32,9,34],[8,35,9,37]]}
["Mississippi State Department of Health-Bureau of Public Water Supply",{"$nulls":18},"Mississippi State Department of Health-Bureau of Public Water Supply"]
["Monthly Fluoride Operating Report (MFOR)--Split Sample Results Page 1",{"$nulls":18},"Monthly Fluoride Operating Report (MFOR)--Split Sample Results Page 2"]
[]
["Water System Name:",{"$nulls":4},{"$f":"INTRO!G3","v":0},{"$nulls":13},"Water System Name:",{"$nulls":4},{"$f":"INTRO!G3","v":0}]
["PWS ID:",{"$nulls":4},{"$f":"INTRO!G4","v":0},{"$nulls":13},"PWS ID:",{"$nulls":4},{"$f":"INTRO!G4","v":0}]
["Number of Treatment Facilities:",{"$nulls":4},{"$f":"INTRO!H16","v":0},{"$nulls":4},"Email to water.fluoride@msdh.ms.gov by the 10th of each month.  Reports are due every month!",{"$nulls":8},"# Wells &/or Plants w/ Fluoride Equipment",{"$nulls":4},{"$f":"INTRO!H16","v":0},{"$nulls":4},"Email to water.fluoride@msdh.ms.gov by the 10th of each month.  Reports are due every month!"]
["Reporting Year:",{"$nulls":4},{"$f":"INTRO!I4","v":0},{"$nulls":13},"Reporting Year:",{"$nulls":4},{"$f":"INTRO!I4","v":0}]
[]
["Date","Split Sample Results",null,null,"Split Sample Results",null,null,"Split Sample Results",null,null,"Split Sample Results",null,null,"Split Sample Results",null,null,"Split Sample Results",null,null,"Date","Split Sample Results",null,null,"Split Sample Results",null,null,"Split Sample Results",null,null,"Split Sample Results",null,null,"Split Sample Results",null,null,"Split Sample Results"]
[]
[null,{"$f":"INTRO!$C31","v":{"v":0,"d":"TF000"}},{"$f":"INTRO!$C31","v":{"v":0,"d":"TF000"}},{"$f":"INTRO!$C31","v":{"v":0,"d":"TF000"}},{"$f":"INTRO!$C32","v":{"v":0,"d":"TF000"}},{"$f":"INTRO!$C32","v":{"v":0,"d":"TF000"}},{"$f":"INTRO!$C32","v":{"v":0,"d":"TF000"}},{"$f":"INTRO!$C33","v":{"v":0,"d":"TF000"}},{"$f":"INTRO!$C33","v":{"v":0,"d":"TF000"}},{"$f":"INTRO!$C33","v":{"v":0,"d":"TF000"}},{"$f":"INTRO!C34","v":{"v":0,"d":"TF000"}},{"$f":"INTRO!C34","v":{"v":0,"d":"TF000"}},{"$f":"INTRO!C34","v":{"v":0,"d":"TF000"}},{"$f":"INTRO!C35","v":{"v":0,"d":"TF000"}},{"$f":"INTRO!C35","v":{"v":0,"d":"TF000"}},{"$f":"INTRO!C35","v":{"v":0,"d":"TF000"}},{"$f":"INTRO!C36","v":{"v":0,"d":"TF000"}},{"$f":"INTRO!C36","v":{"v":0,"d":"TF000"}},{"$f":"INTRO!C36","v":{"v":0,"d":"TF000"}},null,{"$f":"INTRO!C37","v":{"v":0,"d":"TF000"}},{"$f":"INTRO!C37","v":{"v":0,"d":"TF000"}},{"$f":"INTRO!C37","v":{"v":0,"d":"TF000"}},{"$f":"INTRO!C38","v":{"v":0,"d":"TF000"}},{"$f":"INTRO!C38","v":{"v":0,"d":"TF000"}},{"$f":"INTRO!C38","v":{"v":0,"d":"TF000"}},{"$f":"INTRO!C39","v":{"v":0,"d":"TF000"}},{"$f":"INTRO!C39","v":{"v":0,"d":"TF000"}},{"$f":"INTRO!C39","v":{"v":0,"d":"TF000"}},{"$f":"INTRO!C40","v":{"v":0,"d":"TF000"}},{"$f":"INTRO!C40","v":{"v":0,"d":"TF000"}},{"$f":"INTRO!C40","v":{"v":0,"d":"TF000"}},{"$f":"INTRO!C41","v":{"v":0,"d":"TF000"}},{"$f":"INTRO!C41","v":{"v":0,"d":"TF000"}},{"$f":"INTRO!C41","v":{"v":0,"d":"TF000"}},{"$f":"INTRO!C42","v":{"v":0,"d":"TF000"}},{"$f":"INTRO!C42","v":{"v":0,"d":"TF000"}},{"$f":"INTRO!C42","v":{"v":0,"d":"TF000"}}]
[null,"PWS","MSDH","DIFF.","PWS","MSDH","DIFF.","PWS","MSDH","DIFF.","PWS","MSDH","DIFF.","PWS","MSDH","DIFF.","PWS","MSDH","DIFF.",null,"PWS","MSDH","DIFF.","PWS","MSDH","DIFF.","PWS","MSDH","DIFF.","PWS","MSDH","DIFF.","PWS","MSDH","DIFF.","PWS","MSDH","DIFF."]
[{"$nulls":3},{"$f":"ABS(B13-C13)","v":{"v":0,"d":"0.00"}},null,null,{"$f":"ABS(E13-F13)","v":{"v":0,"d":"0.00"}},null,null,{"$f":"ABS(H13-I13)","v":{"v":0,"d":"0.00"}},null,null,{"$f":"ABS(K13-L13)","v":{"v":0,"d":"0.00"}},null,null,{"$f":"ABS(N13-O13)","v":{"v":0,"d":"0.00"}},null,null,{"$f":"ABS(Q13-R13)","v":{"v":0,"d":"0.00"}},{"$f":"IF(A13=\"\",\"\",A13)","v":""},null,null,{"$f":"ABS(U13-V13)","v":{"v":0,"d":"0.00"}},null,null,{"$f":"ABS(X13-Y13)","v":{"v":0,"d":"0.00"}},null,null,{"$f":"ABS(AA13-AB13)","v":{"v":0,"d":"0.00"}},null,null,{"$f":"ABS(AD13-AE13)","v":{"v":0,"d":"0.00"}},null,null,{"$f":"ABS(AG13-AH13)","v":{"v":0,"d":"0.00"}},null,null,{"$f":"ABS(AJ13-AK13)","v":{"v":0,"d":"0.00"}}]
[{"$nulls":3},{"v":0,"d":"0.00"},null,null,{"v":0,"d":"0.00"},null,null,{"v":0,"d":"0.00"},null,null,{"v":0,"d":"0.00"},null,null,{"v":0,"d":"0.00"},null,null,{"v":0,"d":"0.00"},{"$f":"IF(A14=\"\",\"\",A14)","v":""},null,null,{"v":0,"d":"0.00"},null,null,{"v":0,"d":"0.00"},null,null,{"v":0,"d":"0.00"},null,null,{"v":0,"d":"0.00"},null,null,{"v":0,"d":"0.00"},null,null,{"v":0,"d":"0.00"}]
[{"$nulls":3},{"v":0,"d":"0.00"},null,null,{"v":0,"d":"0.00"},null,null,{"v":0,"d":"0.00"},null,null,{"v":0,"d":"0.00"},null,null,{"v":0,"d":"0.00"},null,null,{"v":0,"d":"0.00"},"",null,null,{"v":0,"d":"0.00"},null,null,{"v":0,"d":"0.00"},null,null,{"v":0,"d":"0.00"},null,null,{"v":0,"d":"0.00"},null,null,{"v":0,"d":"0.00"},null,null,{"v":0,"d":"0.00"}]
[{"$nulls":3},{"v":0,"d":"0.00"},null,null,{"v":0,"d":"0.00"},null,null,{"v":0,"d":"0.00"},null,null,{"v":0,"d":"0.00"},null,null,{"v":0,"d":"0.00"},null,null,{"v":0,"d":"0.00"},"",null,null,{"v":0,"d":"0.00"},null,null,{"v":0,"d":"0.00"},null,null,{"v":0,"d":"0.00"},null,null,{"v":0,"d":"0.00"},null,null,{"v":0,"d":"0.00"},null,null,{"v":0,"d":"0.00"}]
[{"$nulls":3},{"v":0,"d":"0.00"},null,null,{"v":0,"d":"0.00"},null,null,{"v":0,"d":"0.00"},null,null,{"v":0,"d":"0.00"},null,null,{"v":0,"d":"0.00"},null,null,{"v":0,"d":"0.00"},"",null,null,{"v":0,"d":"0.00"},null,null,{"v":0,"d":"0.00"},null,null,{"v":0,"d":"0.00"},null,null,{"v":0,"d":"0.00"},null,null,{"v":0,"d":"0.00"},null,null,{"v":0,"d":"0.00"}]
[{"$nulls":3},{"v":0,"d":"0.00"},null,null,{"v":0,"d":"0.00"},null,null,{"v":0,"d":"0.00"},null,null,{"v":0,"d":"0.00"},null,null,{"v":0,"d":"0.00"},null,null,{"v":0,"d":"0.00"},"",null,null,{"v":0,"d":"0.00"},null,null,{"v":0,"d":"0.00"},null,null,{"v":0,"d":"0.00"},null,null,{"v":0,"d":"0.00"},null,null,{"v":0,"d":"0.00"},null,null,{"v":0,"d":"0.00"}]
[{"$nulls":3},{"v":0,"d":"0.00"},null,null,{"v":0,"d":"0.00"},null,null,{"v":0,"d":"0.00"},null,null,{"v":0,"d":"0.00"},null,null,{"v":0,"d":"0.00"},null,null,{"v":0,"d":"0.00"},"",null,null,{"v":0,"d":"0.00"},null,null,{"v":0,"d":"0.00"},null,null,{"v":0,"d":"0.00"},null,null,{"v":0,"d":"0.00"},null,null,{"v":0,"d":"0.00"},null,null,{"v":0,"d":"0.00"}]
[{"$nulls":3},{"v":0,"d":"0.00"},null,null,{"v":0,"d":"0.00"},null,null,{"v":0,"d":"0.00"},null,null,{"v":0,"d":"0.00"},null,null,{"v":0,"d":"0.00"},null,null,{"v":0,"d":"0.00"},"",null,null,{"v":0,"d":"0.00"},null,null,{"v":0,"d":"0.00"},null,null,{"v":0,"d":"0.00"},null,null,{"v":0,"d":"0.00"},null,null,{"v":0,"d":"0.00"},null,null,{"v":0,"d":"0.00"}]
[{"$nulls":3},{"v":0,"d":"0.00"},null,null,{"v":0,"d":"0.00"},null,null,{"v":0,"d":"0.00"},null,null,{"v":0,"d":"0.00"},null,null,{"v":0,"d":"0.00"},null,null,{"v":0,"d":"0.00"},"",null,null,{"v":0,"d":"0.00"},null,null,{"v":0,"d":"0.00"},null,null,{"v":0,"d":"0.00"},null,null,{"v":0,"d":"0.00"},null,null,{"v":0,"d":"0.00"},null,null,{"v":0,"d":"0.00"}]
[{"$nulls":3},{"v":0,"d":"0.00"},null,null,{"v":0,"d":"0.00"},null,null,{"v":0,"d":"0.00"},null,null,{"v":0,"d":"0.00"},null,null,{"v":0,"d":"0.00"},null,null,{"v":0,"d":"0.00"},"",null,null,{"v":0,"d":"0.00"},null,null,{"v":0,"d":"0.00"},null,null,{"v":0,"d":"0.00"},null,null,{"v":0,"d":"0.00"},null,null,{"v":0,"d":"0.00"},null,null,{"v":0,"d":"0.00"}]
[{"$nulls":3},{"v":0,"d":"0.00"},null,null,{"v":0,"d":"0.00"},null,null,{"v":0,"d":"0.00"},null,null,{"v":0,"d":"0.00"},null,null,{"v":0,"d":"0.00"},null,null,{"v":0,"d":"0.00"},"",null,null,{"v":0,"d":"0.00"},null,null,{"v":0,"d":"0.00"},null,null,{"v":0,"d":"0.00"},null,null,{"v":0,"d":"0.00"},null,null,{"v":0,"d":"0.00"},null,null,{"v":0,"d":"0.00"}]
[{"$nulls":3},{"v":0,"d":"0.00"},null,null,{"v":0,"d":"0.00"},null,null,{"v":0,"d":"0.00"},null,null,{"v":0,"d":"0.00"},null,null,{"v":0,"d":"0.00"},null,null,{"v":0,"d":"0.00"},"",null,null,{"v":0,"d":"0.00"},null,null,{"v":0,"d":"0.00"},null,null,{"v":0,"d":"0.00"},null,null,{"v":0,"d":"0.00"},null,null,{"v":0,"d":"0.00"},null,null,{"v":0,"d":"0.00"}]
[{"$nulls":3},{"v":0,"d":"0.00"},null,null,{"v":0,"d":"0.00"},null,null,{"v":0,"d":"0.00"},null,null,{"v":0,"d":"0.00"},null,null,{"v":0,"d":"0.00"},null,null,{"v":0,"d":"0.00"},"",null,null,{"v":0,"d":"0.00"},null,null,{"v":0,"d":"0.00"},null,null,{"v":0,"d":"0.00"},null,null,{"v":0,"d":"0.00"},null,null,{"v":0,"d":"0.00"},null,null,{"v":0,"d":"0.00"}]
[{"$nulls":3},{"v":0,"d":"0.00"},null,null,{"v":0,"d":"0.00"},null,null,{"v":0,"d":"0.00"},null,null,{"v":0,"d":"0.00"},null,null,{"v":0,"d":"0.00"},null,null,{"v":0,"d":"0.00"},"",null,null,{"v":0,"d":"0.00"},null,null,{"v":0,"d":"0.00"},null,null,{"v":0,"d":"0.00"},null,null,{"v":0,"d":"0.00"},null,null,{"v":0,"d":"0.00"},null,null,{"v":0,"d":"0.00"}]
[{"$nulls":3},{"v":0,"d":"0.00"},null,null,{"v":0,"d":"0.00"},null,null,{"v":0,"d":"0.00"},null,null,{"v":0,"d":"0.00"},null,null,{"v":0,"d":"0.00"},null,null,{"v":0,"d":"0.00"},"",null,null,{"v":0,"d":"0.00"},null,null,{"v":0,"d":"0.00"},null,null,{"v":0,"d":"0.00"},null,null,{"v":0,"d":"0.00"},null,null,{"v":0,"d":"0.00"},null,null,{"v":0,"d":"0.00"}]
[{"$nulls":3},{"v":0,"d":"0.00"},null,null,{"v":0,"d":"0.00"},null,null,{"v":0,"d":"0.00"},null,null,{"v":0,"d":"0.00"},null,null,{"v":0,"d":"0.00"},null,null,{"v":0,"d":"0.00"},"",null,null,{"v":0,"d":"0.00"},null,null,{"v":0,"d":"0.00"},null,null,{"v":0,"d":"0.00"},null,null,{"v":0,"d":"0.00"},null,null,{"v":0,"d":"0.00"},null,null,{"v":0,"d":"0.00"}]
[{"$nulls":3},{"v":0,"d":"0.00"},null,null,{"v":0,"d":"0.00"},null,null,{"v":0,"d":"0.00"},null,null,{"v":0,"d":"0.00"},null,null,{"v":0,"d":"0.00"},null,null,{"v":0,"d":"0.00"},"",null,null,{"v":0,"d":"0.00"},null,null,{"v":0,"d":"0.00"},null,null,{"v":0,"d":"0.00"},null,null,{"v":0,"d":"0.00"},null,null,{"v":0,"d":"0.00"},null,null,{"v":0,"d":"0.00"}]
[{"$nulls":3},{"v":0,"d":"0.00"},null,null,{"v":0,"d":"0.00"},null,null,{"v":0,"d":"0.00"},null,null,{"v":0,"d":"0.00"},null,null,{"v":0,"d":"0.00"},null,null,{"v":0,"d":"0.00"},"",null,null,{"v":0,"d":"0.00"},null,null,{"v":0,"d":"0.00"},null,null,{"v":0,"d":"0.00"},null,null,{"v":0,"d":"0.00"},null,null,{"v":0,"d":"0.00"},null,null,{"v":0,"d":"0.00"}]
[{"$nulls":3},{"v":0,"d":"0.00"},null,null,{"v":0,"d":"0.00"},null,null,{"v":0,"d":"0.00"},null,null,{"v":0,"d":"0.00"},null,null,{"v":0,"d":"0.00"},null,null,{"v":0,"d":"0.00"},"",null,null,{"v":0,"d":"0.00"},null,null,{"v":0,"d":"0.00"},null,null,{"v":0,"d":"0.00"},null,null,{"v":0,"d":"0.00"},null,null,{"v":0,"d":"0.00"},null,null,{"v":0,"d":"0.00"}]
[{"$nulls":3},{"v":0,"d":"0.00"},null,null,{"v":0,"d":"0.00"},null,null,{"v":0,"d":"0.00"},null,null,{"v":0,"d":"0.00"},null,null,{"v":0,"d":"0.00"},null,null,{"v":0,"d":"0.00"},"",null,null,{"v":0,"d":"0.00"},null,null,{"v":0,"d":"0.00"},null,null,{"v":0,"d":"0.00"},null,null,{"v":0,"d":"0.00"},null,null,{"v":0,"d":"0.00"},null,null,{"v":0,"d":"0.00"}]
[{"$nulls":3},{"v":0,"d":"0.00"},null,null,{"v":0,"d":"0.00"},null,null,{"v":0,"d":"0.00"},null,null,{"v":0,"d":"0.00"},null,null,{"v":0,"d":"0.00"},null,null,{"v":0,"d":"0.00"},"",null,null,{"v":0,"d":"0.00"},null,null,{"v":0,"d":"0.00"},null,null,{"v":0,"d":"0.00"},null,null,{"v":0,"d":"0.00"},null,null,{"v":0,"d":"0.00"},null,null,{"v":0,"d":"0.00"}]
[{"$nulls":3},{"v":0,"d":"0.00"},null,null,{"v":0,"d":"0.00"},null,null,{"v":0,"d":"0.00"},null,null,{"v":0,"d":"0.00"},null,null,{"v":0,"d":"0.00"},null,null,{"v":0,"d":"0.00"},"",null,null,{"v":0,"d":"0.00"},null,null,{"v":0,"d":"0.00"},null,null,{"v":0,"d":"0.00"},null,null,{"v":0,"d":"0.00"},null,null,{"v":0,"d":"0.00"},null,null,{"v":0,"d":"0.00"}]
[{"$nulls":3},{"v":0,"d":"0.00"},null,null,{"v":0,"d":"0.00"},null,null,{"v":0,"d":"0.00"},null,null,{"v":0,"d":"0.00"},null,null,{"v":0,"d":"0.00"},null,null,{"v":0,"d":"0.00"},"",null,null,{"v":0,"d":"0.00"},null,null,{"v":0,"d":"0.00"},null,null,{"v":0,"d":"0.00"},null,null,{"v":0,"d":"0.00"},null,null,{"v":0,"d":"0.00"},null,null,{"v":0,"d":"0.00"}]
[{"$nulls":3},{"v":0,"d":"0.00"},null,null,{"v":0,"d":"0.00"},null,null,{"v":0,"d":"0.00"},null,null,{"v":0,"d":"0.00"},null,null,{"v":0,"d":"0.00"},null,null,{"v":0,"d":"0.00"},"",null,null,{"v":0,"d":"0.00"},null,null,{"v":0,"d":"0.00"},null,null,{"v":0,"d":"0.00"},null,null,{"v":0,"d":"0.00"},null,null,{"v":0,"d":"0.00"},null,null,{"v":0,"d":"0.00"}]
[{"$nulls":3},{"v":0,"d":"0.00"},null,null,{"v":0,"d":"0.00"},null,null,{"v":0,"d":"0.00"},null,null,{"v":0,"d":"0.00"},null,null,{"v":0,"d":"0.00"},null,null,{"v":0,"d":"0.00"},"",null,null,{"v":0,"d":"0.00"},null,null,{"v":0,"d":"0.00"},null,null,{"v":0,"d":"0.00"},null,null,{"v":0,"d":"0.00"},null,null,{"v":0,"d":"0.00"},null,null,{"v":0,"d":"0.00"}]
[{"$nulls":3},{"v":0,"d":"0.00"},null,null,{"v":0,"d":"0.00"},null,null,{"v":0,"d":"0.00"},null,null,{"v":0,"d":"0.00"},null,null,{"v":0,"d":"0.00"},null,null,{"v":0,"d":"0.00"},"",null,null,{"v":0,"d":"0.00"},null,null,{"v":0,"d":"0.00"},null,null,{"v":0,"d":"0.00"},null,null,{"v":0,"d":"0.00"},null,null,{"v":0,"d":"0.00"},null,null,{"v":0,"d":"0.00"}]
[{"$nulls":3},{"v":0,"d":"0.00"},null,null,{"v":0,"d":"0.00"},null,null,{"v":0,"d":"0.00"},null,null,{"v":0,"d":"0.00"},null,null,{"v":0,"d":"0.00"},null,null,{"v":0,"d":"0.00"},"",null,null,{"v":0,"d":"0.00"},null,null,{"v":0,"d":"0.00"},null,null,{"v":0,"d":"0.00"},null,null,{"v":0,"d":"0.00"},null,null,{"v":0,"d":"0.00"},null,null,{"v":0,"d":"0.00"}]
[{"$nulls":3},{"v":0,"d":"0.00"},null,null,{"v":0,"d":"0.00"},null,null,{"v":0,"d":"0.00"},null,null,{"v":0,"d":"0.00"},null,null,{"v":0,"d":"0.00"},null,null,{"v":0,"d":"0.00"},"",null,null,{"v":0,"d":"0.00"},null,null,{"v":0,"d":"0.00"},null,null,{"v":0,"d":"0.00"},null,null,{"v":0,"d":"0.00"},null,null,{"v":0,"d":"0.00"},null,null,{"v":0,"d":"0.00"}]
["Average",{"$f":"IFERROR(AVERAGE(B13:B40),0)","v":{"v":0,"d":"0.00"}},{"v":0,"d":"0.00"},{"v":0,"d":"0.00"},{"v":0,"d":"0.00"},{"v":0,"d":"0.00"},{"v":0,"d":"0.00"},{"v":0,"d":"0.00"},{"v":0,"d":"0.00"},{"v":0,"d":"0.00"},{"v":0,"d":"0.00"},{"v":0,"d":"0.00"},{"v":0,"d":"0.00"},{"v":0,"d":"0.00"},{"v":0,"d":"0.00"},{"v":0,"d":"0.00"},{"v":0,"d":"0.00"},{"v":0,"d":"0.00"},{"v":0,"d":"0.00"},"Average",{"$f":"IFERROR(AVERAGE(U13:U40),0)","v":{"v":0,"d":"0.00"}},{"v":0,"d":"0.00"},{"v":0,"d":"0.00"},{"v":0,"d":"0.00"},{"v":0,"d":"0.00"},{"v":0,"d":"0.00"},{"v":0,"d":"0.00"},{"v":0,"d":"0.00"},{"v":0,"d":"0.00"},{"v":0,"d":"0.00"},{"v":0,"d":"0.00"},{"v":0,"d":"0.00"},{"v":0,"d":"0.00"},{"v":0,"d":"0.00"},{"v":0,"d":"0.00"},{"v":0,"d":"0.00"},{"v":0,"d":"0.00"},{"v":0,"d":"0.00"}]
["Maximum",{"$f":"MAX(B13:B40)","v":{"v":0,"d":"0.00"}},{"v":0,"d":"0.00"},{"v":0,"d":"0.00"},{"v":0,"d":"0.00"},{"v":0,"d":"0.00"},{"v":0,"d":"0.00"},{"v":0,"d":"0.00"},{"v":0,"d":"0.00"},{"v":0,"d":"0.00"},{"v":0,"d":"0.00"},{"v":0,"d":"0.00"},{"v":0,"d":"0.00"},{"v":0,"d":"0.00"},{"v":0,"d":"0.00"},{"v":0,"d":"0.00"},{"v":0,"d":"0.00"},{"v":0,"d":"0.00"},{"v":0,"d":"0.00"},"Maximum",{"$f":"MAX(U13:U40)","v":{"v":0,"d":"0.00"}},{"v":0,"d":"0.00"},{"v":0,"d":"0.00"},{"v":0,"d":"0.00"},{"v":0,"d":"0.00"},{"v":0,"d":"0.00"},{"v":0,"d":"0.00"},{"v":0,"d":"0.00"},{"v":0,"d":"0.00"},{"v":0,"d":"0.00"},{"v":0,"d":"0.00"},{"v":0,"d":"0.00"},{"v":0,"d":"0.00"},{"v":0,"d":"0.00"},{"v":0,"d":"0.00"},{"v":0,"d":"0.00"},{"v":0,"d":"0.00"},{"v":0,"d":"0.00"}]
["Minimum",{"$f":"MIN(B13:B40)","v":{"v":0,"d":"0.00"}},{"v":0,"d":"0.00"},{"v":0,"d":"0.00"},{"v":0,"d":"0.00"},{"v":0,"d":"0.00"},{"v":0,"d":"0.00"},{"v":0,"d":"0.00"},{"v":0,"d":"0.00"},{"v":0,"d":"0.00"},{"v":0,"d":"0.00"},{"v":0,"d":"0.00"},{"v":0,"d":"0.00"},{"v":0,"d":"0.00"},{"v":0,"d":"0.00"},{"v":0,"d":"0.00"},{"v":0,"d":"0.00"},{"v":0,"d":"0.00"},{"v":0,"d":"0.00"},"Minimum",{"$f":"MIN(U13:U40)","v":{"v":0,"d":"0.00"}},{"v":0,"d":"0.00"},{"v":0,"d":"0.00"},{"v":0,"d":"0.00"},{"v":0,"d":"0.00"},{"v":0,"d":"0.00"},{"v":0,"d":"0.00"},{"v":0,"d":"0.00"},{"v":0,"d":"0.00"},{"v":0,"d":"0.00"},{"v":0,"d":"0.00"},{"v":0,"d":"0.00"},{"v":0,"d":"0.00"},{"v":0,"d":"0.00"},{"v":0,"d":"0.00"},{"v":0,"d":"0.00"},{"v":0,"d":"0.00"},{"v":0,"d":"0.00"}]